program: Orca
programVersion: 5.0.2
elementType: O O N N C C C C C C C C C H H H H H H H H H H H H H H H H H H H H
charge: 0
multiplicity: 1
keywords: wb97x-d3
keywords: def2-TZVPP
keywords: def2/J RIJCOSX
keywords: DEFGRID2
keywords: scfconv7
keywords: smallprint printgap noloewdin
keywords: NOSOSCF
formula: C9H20N2O2
InChI: InChI=1/C9H20N2O2/c1-4-8-13-9(12)10-6-5-7-11(2)3/h10H,4-8H2,1-3H3
33 atoms
O  -1.705152 0.295231 0.316497
O  -1.144782 2.255394 -0.640475
N  2.131295 -1.064007 0.391998
N  0.245861 1.194993 0.828559
C  2.294682 1.257326 -0.579243
C  3.003752 -0.004685 -0.104686
C  1.445883 1.935403 0.488648
C  2.931613 -2.109526 1.001094
C  1.327593 -1.631477 -0.674841
C  -2.984098 0.307239 -0.327872
C  -3.673765 -0.999399 -0.007745
C  -0.877622 1.321051 0.095897
C  -2.954337 -2.222812 -0.556453
H  3.072513 1.958914 -0.891185
H  1.688414 1.069107 -1.46961
H  3.676758 0.275518 0.710766
H  3.647531 -0.377034 -0.919494
H  2.032648 2.060265 1.400194
H  1.162226 2.936389 0.16875
H  0.435037 0.267444 1.186854
H  3.511619 -1.707127 1.832674
H  3.635341 -2.579189 0.297644
H  2.28622 -2.894618 1.397237
H  0.683943 -0.88257 -1.134582
H  0.680453 -2.414844 -0.27745
H  1.938111 -2.076689 -1.475338
H  -2.860597 0.416128 -1.408343
H  -3.573125 1.153098 0.034397
H  -3.810861 -1.089112 1.072959
H  -4.676169 -0.938798 -0.437758
H  -2.837251 -2.157524 -1.639759
H  -1.96079 -2.347135 -0.123651
H  -3.517452 -3.131148 -0.341337
elementType: O N C H
totalener: -615.05806609 hartree
nucrepener: 886.16656708 hartree
electener: -1501.22463317 hartree
oneelecener: -2594.08810820 hartree
twoeener: 1092.86347503 hartree
cpcmener: -0.02324081 hartree
kineticenergy: 612.20971656 hartree
xcener: -59.910310157538 hartree
chargesum: -0.0000000
charge: -0.329585 -0.566614 -0.242938 -0.250622 -0.131809 -0.083640 -0.041260 -0.198387 -0.217158 0.018150 -0.095982 0.517026 -0.257960 0.086157 0.079930 0.091771 0.083761 0.100930 0.096058 0.175907 0.100561 0.078856 0.099946 0.093797 0.112027 0.095648 0.096249 0.109460 0.064303 0.066911 0.081109 0.072631 0.094765
qa: -0.3296 -0.5666 -0.2429 -0.2506 -0.1318 -0.0836 -0.0413 -0.1984 -0.2172 0.0182 -0.0960 0.5170 -0.2580 0.0862 0.0799 0.0918 0.0838 0.1009 0.0961 0.1759 0.1006 0.0789 0.0999 0.0938 0.1120 0.0956 0.0962 0.1095 0.0643 0.0669 0.0811 0.0726 0.0948
va: 2.0617 1.9351 2.8647 3.1339 3.8535 3.8879 3.8867 3.9228 3.9168 3.8436 3.9383 4.3024 3.9194 1.0174 1.0107 1.0009 1.0133 1.0040 1.0259 1.0571 0.9979 1.0026 0.9965 0.9977 0.9894 1.0089 1.0014 1.0013 1.0137 1.0118 1.0014 1.0090 1.0062
dispcorr: -0.013678657 hartree
energy: -615.071744744283
dipole: 4.95031 -4.05909 0.89122 -12.07944 10.55241 -1.52704 -2.07918 2.32042 0.24124
magnitude: 1.78446 au
magnitude: 4.53575 debye
