program: Orca
programVersion: 5.0.2
elementType: O O N N C C C C C C C C C H H H H H H H H H H H H H H H H H H H H
charge: 0
multiplicity: 1
keywords: wb97x-d3
keywords: def2-TZVPP
keywords: def2/J RIJCOSX
keywords: DEFGRID2
keywords: scfconv7
keywords: smallprint printgap noloewdin
keywords: NOSOSCF
formula: C9H20N2O2
InChI: InChI=1/C9H20N2O2/c1-4-8-13-9(12)10-6-5-7-11(2)3/h10H,4-8H2,1-3H3
33 atoms
O  -2.406758 -0.412687 0.57165
O  -1.205968 0.044903 -1.28446
N  4.29178 -0.312667 -0.128935
N  -0.535754 0.752398 0.768597
C  1.817474 0.077962 0.333815
C  3.166847 0.610016 -0.145554
C  0.780835 1.191361 0.355172
C  4.633431 -0.740361 1.211688
C  4.07876 -1.459114 -0.987319
C  -3.48078 -0.957652 -0.204474
C  -4.419595 0.110526 -0.728114
C  -1.364779 0.119388 -0.076703
C  -5.010367 0.986056 0.366132
H  1.470247 -0.725539 -0.320737
H  1.902654 -0.343557 1.338933
H  3.441186 1.478019 0.462227
H  3.052158 0.981596 -1.168504
H  1.092973 1.975863 1.04583
H  0.70283 1.661663 -0.625997
H  -0.694126 0.635222 1.758023
H  4.766819 0.126641 1.860296
H  5.578342 -1.286727 1.199379
H  3.88795 -1.39695 1.681524
H  3.805696 -1.132761 -1.991948
H  3.298286 -2.148507 -0.636179
H  5.001188 -2.036703 -1.071909
H  -4.008478 -1.614612 0.487506
H  -3.092368 -1.576725 -1.0148
H  -3.914783 0.727599 -1.474957
H  -5.221091 -0.411152 -1.258149
H  -4.247194 1.579027 0.871927
H  -5.739097 1.684397 -0.047201
H  -5.521315 0.386248 1.122177
elementType: O N C H
totalener: -615.05879227 hartree
nucrepener: 837.54083053 hartree
electener: -1452.59962280 hartree
oneelecener: -2496.92771251 hartree
twoeener: 1044.32808971 hartree
cpcmener: -0.02715125 hartree
kineticenergy: 612.20993951 hartree
xcener: -59.913037660847 hartree
chargesum: 0.0000000
charge: -0.343290 -0.575943 -0.245052 -0.245134 -0.112577 -0.092965 -0.036289 -0.207500 -0.209015 0.020547 -0.106609 0.534348 -0.264840 0.078702 0.075698 0.087443 0.091251 0.104753 0.090119 0.177420 0.101722 0.101710 0.079704 0.101703 0.079597 0.102178 0.111367 0.103652 0.067287 0.075779 0.080362 0.093024 0.080847
qa: -0.3433 -0.5759 -0.2451 -0.2451 -0.1126 -0.0930 -0.0363 -0.2075 -0.2090 0.0205 -0.1066 0.5343 -0.2648 0.0787 0.0757 0.0874 0.0913 0.1048 0.0901 0.1774 0.1017 0.1017 0.0797 0.1017 0.0796 0.1022 0.1114 0.1037 0.0673 0.0758 0.0804 0.0930 0.0808
va: 2.0572 1.9177 2.8869 3.1944 3.7755 3.9315 3.8896 3.9438 3.9432 3.8490 3.8665 4.2826 3.9249 1.0170 1.0144 1.0022 1.0016 1.0055 1.0188 1.0141 0.9938 0.9940 0.9931 0.9934 0.9927 0.9947 0.9969 1.0174 1.0219 1.0134 1.0094 1.0041 1.0011
dispcorr: -0.011774131 hartree
energy: -615.070566396818
dipole: 4.90150 -5.28936 -0.38786 -1.15979 1.04528 -0.11451 1.94471 -0.35869 1.58602
magnitude: 1.63677 au
magnitude: 4.16034 debye
