program: Orca
programVersion: 5.0.2
elementType: O O N N C C C C C C C C C H H H H H H H H H H H H H H H H H H H H
charge: 0
multiplicity: 1
keywords: wb97x-d3
keywords: def2-TZVPP
keywords: def2/J RIJCOSX
keywords: DEFGRID2
keywords: scfconv7
keywords: smallprint printgap noloewdin
keywords: NOSOSCF
formula: C9H20N2O2
InChI: InChI=1/C9H20N2O2/c1-4-8-13-9(12)10-6-5-7-11(2)3/h10H,4-8H2,1-3H3
33 atoms
O  -2.354237 0.850173 0.930293
O  -1.434223 0.876889 -1.13235
N  4.163986 -0.926677 -0.429884
N  -0.196723 1.280937 0.733162
C  1.882903 0.039783 0.17749
C  3.231561 0.185948 -0.526304
C  1.096469 1.339621 0.086493
C  3.626063 -2.146596 -0.994465
C  4.618601 -1.149132 0.926928
C  -3.658617 0.60725 0.391416
C  -3.900215 -0.8494 0.0515
C  -1.328549 0.983296 0.078973
C  -5.33015 -1.05245 -0.427054
H  1.29716 -0.766896 -0.272814
H  2.023239 -0.216791 1.231875
H  3.737424 1.074798 -0.136321
H  3.049946 0.382769 -1.587459
H  1.665926 2.148359 0.549424
H  0.951714 1.62492 -0.955647
H  -0.209673 1.254241 1.741596
H  3.279956 -1.969342 -2.014015
H  2.788569 -2.576499 -0.427412
H  4.405606 -2.909208 -1.042393
H  5.023824 -0.225961 1.344046
H  5.421262 -1.888821 0.932377
H  3.841436 -1.512709 1.613693
H  -3.839465 1.248124 -0.474352
H  -4.341983 0.92452 1.179945
H  -3.204434 -1.180136 -0.721877
H  -3.713097 -1.465262 0.934602
H  -5.538625 -0.463917 -1.322149
H  -5.515598 -2.097993 -0.672064
H  -6.053034 -0.759816 0.336454
elementType: O N C H
totalener: -615.05866245 hartree
nucrepener: 828.30035307 hartree
electener: -1443.35901551 hartree
oneelecener: -2478.35329218 hartree
twoeener: 1034.99427667 hartree
cpcmener: -0.02713439 hartree
kineticenergy: 612.19793938 hartree
xcener: -59.911274952693 hartree
chargesum: -0.0000000
charge: -0.343319 -0.580132 -0.246570 -0.231668 -0.096445 -0.097038 -0.044550 -0.209384 -0.204461 0.033110 -0.093499 0.532245 -0.273472 0.075687 0.076982 0.085874 0.092141 0.104386 0.087684 0.175144 0.102076 0.080837 0.102143 0.100998 0.100981 0.078575 0.090338 0.111037 0.065433 0.064066 0.084396 0.093579 0.082829
qa: -0.3433 -0.5801 -0.2466 -0.2317 -0.0964 -0.0970 -0.0446 -0.2094 -0.2045 0.0331 -0.0935 0.5322 -0.2735 0.0757 0.0770 0.0859 0.0921 0.1044 0.0877 0.1751 0.1021 0.0808 0.1021 0.1010 0.1010 0.0786 0.0903 0.1110 0.0654 0.0641 0.0844 0.0936 0.0828
va: 2.0704 1.9117 2.8913 3.2049 3.7927 3.9378 3.8882 3.9414 3.9444 3.8429 3.8619 4.2787 3.9462 1.0126 1.0128 1.0028 1.0007 1.0032 1.0246 1.0152 0.9930 0.9917 0.9949 0.9942 0.9940 0.9937 1.0144 0.9997 1.0253 1.0121 1.0009 1.0024 1.0017
dispcorr: -0.011262062 hartree
energy: -615.069924507799
dipole: 4.43007 -4.46129 -0.03122 -8.63068 8.47860 -0.15208 0.37813 1.28621 1.66434
magnitude: 1.67156 au
magnitude: 4.24878 debye
