program: Orca
programVersion: 5.0.2
elementType: O O N N C C C C C C C C C H H H H H H H H H H H H H H H H H H H H
charge: 0
multiplicity: 1
keywords: wb97x-d3
keywords: def2-TZVPP
keywords: def2/J RIJCOSX
keywords: DEFGRID2
keywords: scfconv7
keywords: smallprint printgap noloewdin
keywords: NOSOSCF
formula: C9H20N2O2
InChI: InChI=1/C9H20N2O2/c1-4-8-13-9(12)10-6-5-7-11(2)3/h10H,4-8H2,1-3H3
33 atoms
O  -2.330358 -0.560015 -0.730171
O  -1.424594 0.631318 0.963108
N  4.439721 -0.208884 0.489068
N  -0.324738 0.323624 -1.003143
C  1.980869 -0.089589 -0.179815
C  3.281566 0.620897 0.19468
C  0.930168 0.924385 -0.608126
C  4.218792 -1.082129 1.623024
C  4.877133 -0.971421 -0.662184
C  -3.590034 -0.647365 -0.056262
C  -4.456292 0.572444 -0.30133
C  -1.358033 0.167988 -0.163635
C  -5.820528 0.412142 0.351973
H  2.148219 -0.791554 -1.001479
H  1.598904 -0.669494 0.664748
H  3.093823 1.257882 1.06443
H  3.558728 1.296494 -0.620451
H  0.738883 1.638894 0.191954
H  1.302946 1.504128 -1.45414
H  -0.346513 -0.171152 -1.881992
H  3.480318 -1.876352 1.445659
H  3.882611 -0.503544 2.484696
H  5.153572 -1.571069 1.9025
H  4.178573 -1.758149 -0.978572
H  5.829822 -1.457464 -0.445444
H  5.035549 -0.307851 -1.513568
H  -3.446486 -0.8226 1.011934
H  -4.064932 -1.536089 -0.472524
H  -3.965895 1.466956 0.089595
H  -4.575856 0.718699 -1.377532
H  -6.344761 -0.466312 -0.028022
H  -5.735336 0.304703 1.434446
H  -6.449613 1.280158 0.156666
elementType: O N C H
totalener: -615.05878374 hartree
nucrepener: 824.48450956 hartree
electener: -1439.54329330 hartree
oneelecener: -2470.71854605 hartree
twoeener: 1031.17525274 hartree
cpcmener: -0.02723638 hartree
kineticenergy: 612.20694416 hartree
xcener: -59.912859448384 hartree
chargesum: -0.0000000
charge: -0.343314 -0.578057 -0.246308 -0.232444 -0.097693 -0.097057 -0.044795 -0.209046 -0.206694 0.038170 -0.092341 0.526643 -0.276130 0.076522 0.076374 0.092207 0.086118 0.088186 0.105045 0.176451 0.080746 0.102082 0.102321 0.078572 0.102030 0.101774 0.087830 0.110153 0.066754 0.064121 0.083289 0.085235 0.093256
qa: -0.3433 -0.5781 -0.2463 -0.2324 -0.0977 -0.0971 -0.0448 -0.2090 -0.2067 0.0382 -0.0923 0.5266 -0.2761 0.0765 0.0764 0.0922 0.0861 0.0882 0.1050 0.1765 0.0807 0.1021 0.1023 0.0786 0.1020 0.1018 0.0878 0.1102 0.0668 0.0641 0.0833 0.0852 0.0933
va: 2.0717 1.9146 2.8909 3.1981 3.7913 3.9392 3.8866 3.9415 3.9440 3.8406 3.8647 4.2877 3.9479 1.0135 1.0129 1.0007 1.0026 1.0245 1.0032 1.0148 0.9921 0.9932 0.9945 0.9937 0.9939 0.9941 1.0167 0.9993 1.0223 1.0120 1.0013 1.0009 1.0022
dispcorr: -0.011235448 hartree
energy: -615.070019192068
dipole: 4.38244 -4.49242 -0.10998 -2.22499 1.51289 -0.71210 0.67322 -2.17070 -1.49748
magnitude: 1.66181 au
magnitude: 4.22400 debye
