program: Orca
programVersion: 5.0.2
elementType: O O N N C C C C C C C C C H H H H H H H H H H H H H H H H H H H H
charge: 0
multiplicity: 1
keywords: wb97x-d3
keywords: def2-TZVPP
keywords: def2/J RIJCOSX
keywords: DEFGRID2
keywords: scfconv7
keywords: smallprint printgap noloewdin
keywords: NOSOSCF
formula: C9H20N2O2
InChI: InChI=1/C9H20N2O2/c1-4-8-13-9(12)10-6-5-7-11(2)3/h10H,4-8H2,1-3H3
33 atoms
O  -2.341442 -0.130634 0.867173
O  -1.35341 0.082583 -1.154102
N  4.412361 -0.416452 -0.26809
N  -0.351882 0.820382 0.750248
C  1.958595 0.043863 0.260115
C  3.279975 0.491831 -0.364764
C  0.927493 1.159104 0.165955
C  4.842202 -0.619024 1.099892
C  4.157346 -1.686296 -0.915685
C  -3.564418 -0.582464 0.275268
C  -4.455437 0.567961 -0.149699
C  -1.342851 0.243712 0.055423
C  -5.778431 0.055238 -0.697978
H  1.573511 -0.845226 -0.246074
H  2.09825 -0.221092 1.311591
H  3.578133 1.441729 0.089693
H  3.108715 0.704308 -1.424556
H  1.298197 2.047618 0.679394
H  0.772494 1.449205 -0.873186
H  -0.414587 0.813956 1.756958
H  5.777104 -1.181847 1.115598
H  4.124909 -1.168472 1.725191
H  5.032904 0.341689 1.580617
H  3.829171 -1.525386 -1.943751
H  3.398969 -2.30462 -0.415847
H  5.075752 -2.274707 -0.954991
H  -4.050654 -1.166896 1.056811
H  -3.363167 -1.256299 -0.560115
H  -4.637451 1.219339 0.70843
H  -3.953763 1.172697 -0.9087
H  -6.312437 -0.543817 0.041584
H  -6.428704 0.882235 -0.982219
H  -5.630667 -0.565696 -1.582936
elementType: O N C H
totalener: -615.05896459 hartree
nucrepener: 825.49079845 hartree
electener: -1440.54976304 hartree
oneelecener: -2472.76059603 hartree
twoeener: 1032.21083300 hartree
cpcmener: -0.02726016 hartree
kineticenergy: 612.20342306 hartree
xcener: -59.912048482781 hartree
chargesum: -0.0000000
charge: -0.343463 -0.578699 -0.247056 -0.234429 -0.098800 -0.095392 -0.044360 -0.204829 -0.209038 0.035569 -0.091757 0.529380 -0.275285 0.076219 0.075457 0.086655 0.092105 0.105277 0.088448 0.176072 0.101221 0.078893 0.101095 0.102092 0.080575 0.102123 0.111235 0.088302 0.063832 0.067275 0.083042 0.093484 0.084759
qa: -0.3435 -0.5787 -0.2471 -0.2344 -0.0988 -0.0954 -0.0444 -0.2048 -0.2090 0.0356 -0.0918 0.5294 -0.2753 0.0762 0.0755 0.0867 0.0921 0.1053 0.0884 0.1761 0.1012 0.0789 0.1011 0.1021 0.0806 0.1021 0.1112 0.0883 0.0638 0.0673 0.0830 0.0935 0.0848
va: 2.0725 1.9131 2.8926 3.1985 3.7834 3.9362 3.8896 3.9441 3.9418 3.8408 3.8652 4.2842 3.9480 1.0144 1.0142 1.0026 1.0007 1.0039 1.0223 1.0152 0.9939 0.9935 0.9942 0.9931 0.9921 0.9949 0.9989 1.0166 1.0123 1.0221 1.0013 1.0021 1.0009
dispcorr: -0.011269990 hartree
energy: -615.070234582200
dipole: 4.24618 -4.42493 -0.17875 -2.59245 2.69259 0.10014 0.25334 1.39685 1.65020
magnitude: 1.66287 au
magnitude: 4.22667 debye
