program: Orca
programVersion: 5.0.2
elementType: O O N N C C C C C C C C C H H H H H H H H H H H H H H H H H H H H
charge: 0
multiplicity: 1
keywords: wb97x-d3
keywords: def2-TZVPP
keywords: def2/J RIJCOSX
keywords: DEFGRID2
keywords: scfconv7
keywords: smallprint printgap noloewdin
keywords: NOSOSCF
formula: C9H20N2O2
InChI: InChI=1/C9H20N2O2/c1-4-8-13-9(12)10-6-5-7-11(2)3/h10H,4-8H2,1-3H3
33 atoms
O  -2.025061 -0.569901 -0.455465
O  -1.384035 1.130788 0.886494
N  3.910984 -1.064978 0.026756
N  -0.148143 0.500703 -0.916294
C  2.100167 0.726862 0.148405
C  2.764933 -0.426349 -0.6018
C  0.984998 1.367961 -0.666207
C  3.572752 -1.699663 1.283366
C  5.027323 -0.158623 0.196287
C  -3.291098 -0.679486 0.203476
C  -4.324659 0.256457 -0.390712
C  -1.194042 0.412667 -0.081295
C  -5.676793 0.067399 0.280271
H  1.700545 0.395799 1.111007
H  2.833637 1.508289 0.364717
H  3.085286 -0.058609 -1.582046
H  2.022487 -1.205262 -0.798062
H  0.629169 2.270048 -0.17101
H  1.374809 1.683977 -1.635506
H  -0.051189 -0.207875 -1.627489
H  3.30859 -0.999423 2.087709
H  4.417814 -2.291634 1.639346
H  2.731526 -2.381006 1.147364
H  5.272689 0.317168 -0.754447
H  5.910041 -0.712943 0.520025
H  4.859929 0.63828 0.93402
H  -3.183511 -0.519217 1.278109
H  -3.592377 -1.717082 0.056436
H  -4.000976 1.294091 -0.279507
H  -4.412066 0.062971 -1.46248
H  -5.635054 0.316319 1.341784
H  -6.431734 0.706422 -0.177214
H  -6.023906 -0.963798 0.195009
elementType: O N C H
totalener: -615.05841171 hartree
nucrepener: 836.25156757 hartree
electener: -1451.30997928 hartree
oneelecener: -2494.19797260 hartree
twoeener: 1042.88799332 hartree
cpcmener: -0.02698595 hartree
kineticenergy: 612.20289157 hartree
xcener: -59.912452285511 hartree
chargesum: -0.0000000
charge: -0.342545 -0.577418 -0.250241 -0.233746 -0.106091 -0.082125 -0.065296 -0.207769 -0.208570 0.035719 -0.091013 0.529845 -0.276270 0.073936 0.081279 0.090007 0.086243 0.098219 0.107719 0.180095 0.080791 0.101460 0.100803 0.101366 0.101809 0.079777 0.087869 0.111205 0.066651 0.064438 0.085398 0.093718 0.082738
qa: -0.3425 -0.5774 -0.2502 -0.2337 -0.1061 -0.0821 -0.0653 -0.2078 -0.2086 0.0357 -0.0910 0.5298 -0.2763 0.0739 0.0813 0.0900 0.0862 0.0982 0.1077 0.1801 0.0808 0.1015 0.1008 0.1014 0.1018 0.0798 0.0879 0.1112 0.0667 0.0644 0.0854 0.0937 0.0827
va: 2.0715 1.9155 2.8946 3.1854 3.7949 3.9066 3.9206 3.9431 3.9448 3.8404 3.8675 4.2872 3.9482 1.0161 1.0139 1.0014 1.0121 1.0190 1.0010 1.0124 0.9927 0.9942 0.9942 0.9935 0.9941 0.9927 1.0171 0.9988 1.0214 1.0121 1.0009 1.0022 1.0012
dispcorr: -0.011636335 hartree
energy: -615.070048043722
dipole: 4.23052 -4.01271 0.21781 -1.50305 1.09198 -0.41108 1.94341 -2.87148 -0.92807
magnitude: 1.03814 au
magnitude: 2.63875 debye
