program: Orca
programVersion: 5.0.2
elementType: O O N N C C C C C C C C C H H H H H H H H H H H H H H H H H H H H
charge: 0
multiplicity: 1
keywords: wb97x-d3
keywords: def2-TZVPP
keywords: def2/J RIJCOSX
keywords: DEFGRID2
keywords: scfconv7
keywords: smallprint printgap noloewdin
keywords: NOSOSCF
formula: C9H20N2O2
InChI: InChI=1/C9H20N2O2/c1-4-8-13-9(12)10-6-5-7-11(2)3/h10H,4-8H2,1-3H3
33 atoms
O  -2.131643 -0.110115 -1.111271
O  -1.55205 1.891394 -0.226797
N  3.067061 -0.998703 0.042116
N  -0.006907 0.489177 -1.126922
C  1.600845 0.917127 0.728483
C  2.036059 -0.524679 0.952428
C  1.153538 1.238621 -0.691169
C  3.348504 -2.393773 0.310905
C  4.281979 -0.218582 0.162473
C  -3.517469 0.057637 -0.789559
C  -3.893391 -0.6946 0.470963
C  -1.252133 0.838306 -0.763477
C  -3.244212 -0.172927 1.744241
H  0.782896 1.127471 1.422909
H  2.402483 1.609006 0.998062
H  1.16811 -1.181241 0.845154
H  2.359208 -0.623231 2.003323
H  0.935568 2.302368 -0.777512
H  1.956768 1.037779 -1.397989
H  0.137818 -0.457538 -1.442662
H  3.73642 -2.572695 1.325389
H  4.087102 -2.773177 -0.396613
H  2.443363 -2.991327 0.193488
H  5.050842 -0.628876 -0.493315
H  4.689545 -0.205344 1.185399
H  4.121694 0.815066 -0.143519
H  -4.061731 -0.34696 -1.643135
H  -3.771767 1.115258 -0.707405
H  -4.980793 -0.627274 0.55975
H  -3.664695 -1.755747 0.341551
H  -3.459403 0.885194 1.898975
H  -3.621656 -0.714825 2.611925
H  -2.160529 -0.299364 1.737277
elementType: O N C H
totalener: -615.05851620 hartree
nucrepener: 865.85805382 hartree
electener: -1480.91657002 hartree
oneelecener: -2553.57882403 hartree
twoeener: 1072.66225402 hartree
cpcmener: -0.02453106 hartree
kineticenergy: 612.19967496 hartree
xcener: -59.910542354594 hartree
chargesum: -0.0000000
charge: -0.338911 -0.567326 -0.240579 -0.232663 -0.118022 -0.111111 -0.062860 -0.194672 -0.196208 0.022858 -0.080459 0.522150 -0.275637 0.085491 0.084438 0.091784 0.088052 0.098944 0.107607 0.176745 0.074327 0.099758 0.099073 0.100535 0.081760 0.094027 0.108195 0.094192 0.066453 0.062905 0.083776 0.095738 0.079638
qa: -0.3389 -0.5673 -0.2406 -0.2327 -0.1180 -0.1111 -0.0629 -0.1947 -0.1962 0.0229 -0.0805 0.5222 -0.2756 0.0855 0.0844 0.0918 0.0881 0.0989 0.1076 0.1767 0.0743 0.0998 0.0991 0.1005 0.0818 0.0940 0.1082 0.0942 0.0665 0.0629 0.0838 0.0957 0.0796
va: 2.0634 1.9267 2.8602 3.1761 3.8110 3.8958 3.8981 3.9282 3.9393 3.8575 3.8759 4.3106 3.9385 1.0201 1.0107 1.0043 1.0122 1.0193 1.0098 1.0168 1.0028 0.9965 0.9957 0.9968 1.0039 0.9938 0.9997 1.0178 1.0144 1.0127 1.0053 1.0058 1.0002
dispcorr: -0.012877999 hartree
energy: -615.071394199090
dipole: 7.77798 -7.13183 0.64615 -6.23101 4.83739 -1.39362 7.88184 -7.79814 0.08370
magnitude: 1.53840 au
magnitude: 3.91031 debye
