program: Orca
programVersion: 5.0.2
elementType: O O N N C C C C C C C C C H H H H H H H H H H H H H H H H H H H H
charge: 0
multiplicity: 1
keywords: wb97x-d3
keywords: def2-TZVPP
keywords: def2/J RIJCOSX
keywords: DEFGRID2
keywords: scfconv7
keywords: smallprint printgap noloewdin
keywords: NOSOSCF
formula: C9H20N2O2
InChI: InChI=1/C9H20N2O2/c1-4-8-13-9(12)10-6-5-7-11(2)3/h10H,4-8H2,1-3H3
33 atoms
O  -2.093931 -0.054043 -1.122788
O  -1.510976 1.882462 -0.106533
N  2.985497 -1.030488 0.034152
N  0.021708 0.580154 -1.159423
C  1.607445 0.947459 0.72946
C  1.969128 -0.515647 0.938587
C  1.183124 1.306189 -0.688023
C  3.205296 -2.436168 0.305009
C  4.231764 -0.303436 0.163942
C  -3.475558 0.081658 -0.767886
C  -3.827533 -0.741664 0.454376
C  -1.216273 0.878045 -0.732087
C  -3.171294 -0.285718 1.749049
H  0.79942 1.188648 1.424646
H  2.440233 1.597009 1.009208
H  1.069523 -1.125203 0.814005
H  2.274878 -0.642925 1.991538
H  0.982062 2.375059 -0.752663
H  1.991575 1.108956 -1.389203
H  0.170571 -0.337119 -1.550342
H  3.578252 -2.629754 1.322363
H  3.931757 -2.847896 -0.396947
H  2.27618 -2.994505 0.182743
H  4.98766 -0.748869 -0.483889
H  4.630513 -0.304597 1.190264
H  4.119781 0.734993 -0.147036
H  -4.029523 -0.281752 -1.633301
H  -3.737643 1.130749 -0.624982
H  -4.914555 -0.690261 0.557558
H  -3.590804 -1.791788 0.264049
H  -2.086776 -0.402274 1.72583
H  -3.39385 0.760311 1.964326
H  -3.536725 -0.878067 2.588337
elementType: O N C H
totalener: -615.05852865 hartree
nucrepener: 869.15231000 hartree
electener: -1484.21083865 hartree
oneelecener: -2560.19752713 hartree
twoeener: 1075.98668847 hartree
cpcmener: -0.02443932 hartree
kineticenergy: 612.20809184 hartree
xcener: -59.912239645108 hartree
chargesum: -0.0000000
charge: -0.338149 -0.566945 -0.239522 -0.233390 -0.115548 -0.117015 -0.065415 -0.194679 -0.196300 0.023186 -0.081170 0.522371 -0.273679 0.085632 0.085229 0.093180 0.088484 0.101098 0.107024 0.176372 0.074402 0.099916 0.099055 0.100651 0.081976 0.093490 0.108947 0.094022 0.066614 0.062901 0.077974 0.083454 0.095834
qa: -0.3381 -0.5669 -0.2395 -0.2334 -0.1155 -0.1170 -0.0654 -0.1947 -0.1963 0.0232 -0.0812 0.5224 -0.2737 0.0856 0.0852 0.0932 0.0885 0.1011 0.1070 0.1764 0.0744 0.0999 0.0991 0.1007 0.0820 0.0935 0.1089 0.0940 0.0666 0.0629 0.0780 0.0835 0.0958
va: 2.0644 1.9267 2.8623 3.1740 3.7907 3.9037 3.9051 3.9280 3.9401 3.8563 3.8767 4.3108 3.9390 1.0221 1.0112 1.0037 1.0116 1.0167 1.0085 1.0173 1.0031 0.9966 0.9956 0.9967 1.0036 0.9939 0.9996 1.0176 1.0144 1.0125 1.0003 1.0056 1.0060
dispcorr: -0.013017391 hartree
energy: -615.071546041000
dipole: 7.57812 -6.94280 0.63533 -6.66204 5.30316 -1.35888 7.67945 -7.72015 -0.04070
magnitude: 1.50062 au
magnitude: 3.81426 debye
