program: Orca
programVersion: 5.0.2
elementType: O O N N C C C C C C C C C H H H H H H H H H H H H H H H H H H H H
charge: 0
multiplicity: 1
keywords: wb97x-d3
keywords: def2-TZVPP
keywords: def2/J RIJCOSX
keywords: DEFGRID2
keywords: scfconv7
keywords: smallprint printgap noloewdin
keywords: NOSOSCF
formula: C9H20N2O2
InChI: InChI=1/C9H20N2O2/c1-4-8-13-9(12)10-6-5-7-11(2)3/h10H,4-8H2,1-3H3
33 atoms
O  -1.634109 -0.053805 1.116919
O  -1.571125 1.901214 -0.017821
N  2.309425 -1.000388 0.043859
N  0.291137 1.008167 0.945774
C  1.89367 1.27893 -0.941098
C  2.874872 0.151779 -0.649417
C  1.252223 1.880901 0.301351
C  1.359631 -1.704876 -0.796724
C  3.374767 -1.903682 0.436173
C  -3.037143 -0.234377 0.891972
C  -3.300513 -1.234128 -0.215326
C  -1.011628 1.019964 0.612982
C  -2.840344 -0.793263 -1.596243
H  2.458975 2.067609 -1.444167
H  1.118916 0.968408 -1.647422
H  3.673308 0.555777 -0.020329
H  3.353877 -0.15647 -1.594244
H  2.028502 2.123848 1.029405
H  0.760822 2.82003 0.055276
H  0.674015 0.120286 1.243642
H  1.805135 -2.056258 -1.740079
H  0.506406 -1.07611 -1.051438
H  0.970028 -2.57636 -0.269174
H  3.946771 -2.294371 -0.418941
H  2.965112 -2.756749 0.978267
H  4.075647 -1.395586 1.099717
H  -3.522179 0.719785 0.682769
H  -3.435641 -0.607956 1.835436
H  -2.84274 -2.192276 0.043957
H  -4.379813 -1.406804 -0.226682
H  -3.127998 -1.530731 -2.345999
H  -3.288686 0.158856 -1.883205
H  -1.755845 -0.686832 -1.655214
elementType: O N C H
totalener: -615.05719992 hartree
nucrepener: 893.22776737 hartree
electener: -1508.28496730 hartree
oneelecener: -2608.32302353 hartree
twoeener: 1100.03805623 hartree
cpcmener: -0.02328877 hartree
kineticenergy: 612.20740571 hartree
xcener: -59.911822090238 hartree
chargesum: 0.0000000
charge: -0.335677 -0.566461 -0.251136 -0.241097 -0.125617 -0.080057 -0.047601 -0.173613 -0.200444 0.021643 -0.088455 0.507976 -0.275717 0.086980 0.078992 0.091584 0.083128 0.102187 0.096901 0.174266 0.091168 0.063412 0.106538 0.078772 0.100972 0.100216 0.094299 0.108453 0.065863 0.069635 0.095789 0.088235 0.078867
qa: -0.3357 -0.5665 -0.2511 -0.2411 -0.1256 -0.0801 -0.0476 -0.1736 -0.2004 0.0216 -0.0885 0.5080 -0.2757 0.0870 0.0790 0.0916 0.0831 0.1022 0.0969 0.1743 0.0912 0.0634 0.1065 0.0788 0.1010 0.1002 0.0943 0.1085 0.0659 0.0696 0.0958 0.0882 0.0789
va: 2.0547 1.9293 2.8737 3.1394 3.8463 3.8923 3.8849 3.9213 3.9265 3.8534 3.8739 4.3214 3.9344 1.0177 1.0099 1.0015 1.0139 1.0033 1.0268 1.0582 1.0102 0.9953 0.9978 1.0022 0.9959 0.9976 1.0192 1.0001 1.0113 1.0148 1.0061 1.0071 0.9923
dispcorr: -0.014226398 hartree
energy: -615.071426321281
dipole: 5.78423 -4.67156 1.11267 -8.79623 7.39901 -1.39723 -6.90975 6.83256 -0.07719
magnitude: 1.78780 au
magnitude: 4.54423 debye
