program: Orca
programVersion: 5.0.2
elementType: O O N N C C C C C C C C C H H H H H H H H H H H H H H H H H H H H
charge: 0
multiplicity: 1
keywords: wb97x-d3
keywords: def2-TZVPP
keywords: def2/J RIJCOSX
keywords: DEFGRID2
keywords: scfconv7
keywords: smallprint printgap noloewdin
keywords: NOSOSCF
formula: C9H20N2O2
InChI: InChI=1/C9H20N2O2/c1-4-8-13-9(12)10-6-5-7-11(2)3/h10H,4-8H2,1-3H3
33 atoms
O  -2.254409 0.921177 0.740106
O  -1.137187 1.270225 -1.195596
N  2.670734 -1.456572 0.162137
N  -0.215711 1.758661 0.826071
C  2.125825 0.940115 0.612977
C  1.820162 -0.323983 -0.174841
C  1.122695 2.059684 0.362247
C  4.05347 -1.208748 -0.195675
C  2.199366 -2.633934 -0.540165
C  -3.404731 0.389866 0.0699
C  -3.418822 -1.125112 0.079969
C  -1.191161 1.305128 0.022729
C  -2.295022 -1.789532 -0.700381
H  2.152057 0.717035 1.683388
H  3.111729 1.330731 0.350234
H  1.867818 -0.094618 -1.253897
H  0.791436 -0.632068 0.02781
H  1.462405 2.96121 0.872655
H  1.077691 2.305612 -0.697631
H  -0.341082 1.652579 1.82168
H  4.65945 -2.084382 0.038847
H  4.465782 -0.375648 0.372109
H  4.189808 -0.986706 -1.265186
H  2.797551 -3.503493 -0.265472
H  2.242621 -2.533778 -1.635459
H  1.164155 -2.847872 -0.269549
H  -3.473633 0.778132 -0.947106
H  -4.26045 0.7717 0.627039
H  -3.41708 -1.481074 1.113453
H  -4.381987 -1.424619 -0.341421
H  -2.270158 -1.451149 -1.73698
H  -1.315239 -1.597863 -0.259898
H  -2.430518 -2.871393 -0.711581
elementType: O N C H
totalener: -615.05985880 hartree
nucrepener: 875.24632220 hartree
electener: -1490.30618100 hartree
oneelecener: -2572.51226985 hartree
twoeener: 1082.20608885 hartree
cpcmener: -0.02707098 hartree
kineticenergy: 612.20085690 hartree
xcener: -59.910850001367 hartree
chargesum: 0.0000000
charge: -0.336423 -0.565134 -0.227755 -0.225527 -0.075080 -0.098802 -0.056395 -0.199391 -0.191272 0.020311 -0.084751 0.506431 -0.265532 0.065247 0.073125 0.069938 0.071136 0.108460 0.097353 0.172671 0.100686 0.101249 0.078258 0.101633 0.077379 0.094704 0.095695 0.108565 0.063328 0.069150 0.083562 0.069169 0.098013
qa: -0.3364 -0.5651 -0.2278 -0.2255 -0.0751 -0.0988 -0.0564 -0.1994 -0.1913 0.0203 -0.0848 0.5064 -0.2655 0.0652 0.0731 0.0699 0.0711 0.1085 0.0974 0.1727 0.1007 0.1012 0.0783 0.1016 0.0774 0.0947 0.0957 0.1086 0.0633 0.0691 0.0836 0.0692 0.0980
va: 2.0661 1.9252 2.9187 3.1897 3.8041 3.9641 3.9058 3.9295 3.9311 3.8590 3.8817 4.3263 3.9366 1.0263 1.0202 1.0097 0.9961 1.0022 1.0199 1.0164 0.9950 0.9951 1.0038 0.9956 1.0035 0.9954 1.0174 0.9999 1.0116 1.0147 1.0067 0.9950 1.0070
dispcorr: -0.013329272 hartree
energy: -615.073188070152
dipole: 7.51197 -7.33697 0.17500 -10.54776 10.45543 -0.09233 -2.17468 3.25162 1.07694
magnitude: 1.09497 au
magnitude: 2.78318 debye
