program: Orca
programVersion: 5.0.2
elementType: O O N N C C C C C C C C C H H H H H H H H H H H H H H H H H H H H
charge: 0
multiplicity: 1
keywords: wb97x-d3
keywords: def2-TZVPP
keywords: def2/J RIJCOSX
keywords: DEFGRID2
keywords: scfconv7
keywords: smallprint printgap noloewdin
keywords: NOSOSCF
formula: C9H20N2O2
InChI: InChI=1/C9H20N2O2/c1-4-8-13-9(12)10-6-5-7-11(2)3/h10H,4-8H2,1-3H3
33 atoms
O  -2.066909 -0.032445 1.153964
O  -1.510165 1.918993 0.15306
N  2.735098 -1.020215 -0.067384
N  0.020395 0.679516 1.284708
C  1.592508 1.149862 -0.600968
C  1.808654 -0.316927 -0.939472
C  1.180666 1.425326 0.839668
C  4.057672 -0.431531 -0.109918
C  2.804069 -2.41278 -0.458708
C  -3.402037 -0.015164 0.634747
C  -3.540714 -0.918024 -0.573984
C  -1.206791 0.929818 0.799109
C  -2.754438 -0.480122 -1.799809
H  2.491217 1.735843 -0.809553
H  0.829372 1.531492 -1.2838
H  2.132033 -0.377744 -1.992959
H  0.846282 -0.835326 -0.894469
H  1.993299 1.177993 1.520604
H  0.993838 2.491729 0.970053
H  0.183824 -0.238842 1.667888
H  4.488454 -0.404861 -1.123109
H  4.737646 -1.004128 0.522232
H  4.049583 0.588586 0.274206
H  1.81548 -2.871055 -0.404009
H  3.459616 -2.964188 0.2167
H  3.181578 -2.558849 -1.482319
H  -3.715699 1.004584 0.405323
H  -4.030995 -0.379116 1.447609
H  -3.263385 -1.938576 -0.297332
H  -4.606169 -0.949802 -0.815862
H  -1.675841 -0.529301 -1.640134
H  -2.979054 -1.129791 -2.64613
H  -3.004999 0.539424 -2.094917
elementType: O N C H
totalener: -615.05814390 hartree
nucrepener: 879.67261380 hartree
electener: -1494.73075771 hartree
oneelecener: -2581.21603072 hartree
twoeener: 1086.48527301 hartree
cpcmener: -0.02423469 hartree
kineticenergy: 612.20512156 hartree
xcener: -59.911681032564 hartree
chargesum: 0.0000000
charge: -0.335970 -0.561430 -0.237937 -0.226743 -0.115485 -0.124147 -0.070487 -0.194929 -0.194904 0.022310 -0.082575 0.507207 -0.265607 0.086737 0.086706 0.090255 0.097902 0.105006 0.104834 0.174276 0.081240 0.100480 0.093658 0.098898 0.100143 0.075101 0.094829 0.108935 0.063250 0.067577 0.069142 0.096269 0.085458
qa: -0.3360 -0.5614 -0.2379 -0.2267 -0.1155 -0.1241 -0.0705 -0.1949 -0.1949 0.0223 -0.0826 0.5072 -0.2656 0.0867 0.0867 0.0903 0.0979 0.1050 0.1048 0.1743 0.0812 0.1005 0.0937 0.0989 0.1001 0.0751 0.0948 0.1089 0.0632 0.0676 0.0691 0.0963 0.0855
va: 2.0625 1.9324 2.8677 3.1623 3.7593 3.9220 3.9175 3.9399 3.9273 3.8542 3.8773 4.3328 3.9377 1.0116 1.0235 1.0118 0.9953 1.0066 1.0125 1.0210 1.0039 0.9963 0.9949 0.9960 0.9966 1.0034 1.0182 0.9996 1.0125 1.0145 0.9999 1.0061 1.0074
dispcorr: -0.013594403 hartree
energy: -615.071738307506
dipole: 7.81412 -7.11909 0.69503 -7.18512 5.79886 -1.38626 -8.20038 8.17220 -0.02818
magnitude: 1.55099 au
magnitude: 3.94231 debye
