program: Orca
programVersion: 5.0.2
elementType: O O N N C C C C C C C C C H H H H H H H H H H H H H H H H H H H H
charge: 0
multiplicity: 1
keywords: wb97x-d3
keywords: def2-TZVPP
keywords: def2/J RIJCOSX
keywords: DEFGRID2
keywords: scfconv7
keywords: smallprint printgap noloewdin
keywords: NOSOSCF
formula: C9H20N2O2
InChI: InChI=1/C9H20N2O2/c1-4-8-13-9(12)10-6-5-7-11(2)3/h10H,4-8H2,1-3H3
33 atoms
O  -2.291753 0.983237 0.640076
O  -1.072357 1.252131 -1.24732
N  2.616201 -1.477304 0.192621
N  -0.239531 1.773582 0.80405
C  2.098273 0.92351 0.661331
C  1.818593 -0.315653 -0.174454
C  1.118961 2.060939 0.394448
C  4.028957 -1.251096 -0.041006
C  2.178175 -2.619375 -0.585681
C  -3.397142 0.400687 -0.061163
C  -3.414869 -1.10852 0.077111
C  -1.184677 1.320389 -0.034675
C  -2.225278 -1.823956 -0.545604
H  2.071108 0.672166 1.72532
H  3.099549 1.30901 0.455982
H  1.946415 -0.06326 -1.241563
H  0.772504 -0.603768 -0.050873
H  1.450927 2.947776 0.934487
H  1.117186 2.327734 -0.66154
H  -0.410925 1.68699 1.794586
H  4.594929 -2.146302 0.219201
H  4.407928 -0.442795 0.583088
H  4.260507 -1.003863 -1.088544
H  2.729535 -3.512855 -0.290276
H  2.317046 -2.486363 -1.669283
H  1.118447 -2.813541 -0.411021
H  -3.391857 0.699579 -1.109759
H  -4.288232 0.827632 0.398927
H  -3.49913 -1.375696 1.13362
H  -4.338361 -1.450744 -0.397044
H  -1.288257 -1.575874 -0.044541
H  -2.348934 -2.904421 -0.467952
H  -2.115967 -1.580509 -1.603171
elementType: O N C H
totalener: -615.05991471 hartree
nucrepener: 876.71249763 hartree
electener: -1491.77241234 hartree
oneelecener: -2575.46046181 hartree
twoeener: 1083.68804947 hartree
cpcmener: -0.02701981 hartree
kineticenergy: 612.20177197 hartree
xcener: -59.911262262567 hartree
chargesum: 0.0000000
charge: -0.336141 -0.563206 -0.226198 -0.223049 -0.071629 -0.092472 -0.055538 -0.203470 -0.189827 0.020351 -0.083441 0.501324 -0.279517 0.064506 0.073125 0.070609 0.056863 0.109037 0.096402 0.173111 0.101031 0.101405 0.078563 0.101455 0.077349 0.094004 0.096052 0.107744 0.063825 0.069510 0.081517 0.099840 0.086863
qa: -0.3361 -0.5632 -0.2262 -0.2230 -0.0716 -0.0925 -0.0555 -0.2035 -0.1898 0.0204 -0.0834 0.5013 -0.2795 0.0645 0.0731 0.0706 0.0569 0.1090 0.0964 0.1731 0.1010 0.1014 0.0786 0.1015 0.0773 0.0940 0.0961 0.1077 0.0638 0.0695 0.0815 0.0998 0.0869
va: 2.0662 1.9280 2.9200 3.1871 3.8024 3.9737 3.9067 3.9353 3.9325 3.8567 3.8846 4.3320 3.9353 1.0270 1.0188 1.0104 0.9915 1.0023 1.0195 1.0163 0.9953 0.9951 1.0032 0.9955 1.0040 0.9951 1.0180 1.0001 1.0116 1.0147 0.9898 1.0062 1.0046
dispcorr: -0.013448133 hartree
energy: -615.073362838006
dipole: 7.66045 -7.50934 0.15111 -10.67911 10.61061 -0.06850 -1.55539 2.65730 1.10192
magnitude: 1.11434 au
magnitude: 2.83242 debye
