program: Orca
programVersion: 5.0.2
elementType: O O N N C C C C C C C C C H H H H H H H H H H H H H H H H H H H H
charge: 0
multiplicity: 1
keywords: wb97x-d3
keywords: def2-TZVPP
keywords: def2/J RIJCOSX
keywords: DEFGRID2
keywords: scfconv7
keywords: smallprint printgap noloewdin
keywords: NOSOSCF
formula: C9H20N2O2
InChI: InChI=1/C9H20N2O2/c1-4-8-13-9(12)10-6-5-7-11(2)3/h10H,4-8H2,1-3H3
33 atoms
O  -2.253786 0.830005 0.869545
O  -1.216388 1.359486 -1.070307
N  2.656769 -1.525017 -0.564747
N  -0.172042 1.552479 0.940795
C  2.132933 0.745823 0.450162
C  1.746235 -0.39064 -0.495841
C  1.142055 1.902166 0.443543
C  3.966151 -1.158567 -1.062641
C  2.768727 -2.221752 0.70008
C  -3.462411 0.43869 0.206457
C  -3.5734 -1.067571 0.089182
C  -1.207514 1.246736 0.144371
C  -2.514166 -1.72087 -0.785201
H  2.236012 0.375704 1.474375
H  3.10692 1.155184 0.169413
H  1.6363 0.013502 -1.506699
H  0.764835 -0.782425 -0.213647
H  1.531306 2.709714 1.064315
H  1.036725 2.310899 -0.560538
H  -0.24933 1.32798 1.921464
H  3.872802 -0.62849 -2.011663
H  4.557361 -2.056997 -1.248087
H  4.550305 -0.524063 -0.382011
H  3.287431 -1.655866 1.485916
H  3.318352 -3.154664 0.562909
H  1.777704 -2.47908 1.076854
H  -3.538854 0.915199 -0.771428
H  -4.27085 0.826157 0.826641
H  -3.560276 -1.511943 1.087724
H  -4.565379 -1.273251 -0.321446
H  -2.70127 -2.791484 -0.871832
H  -2.51337 -1.305243 -1.793786
H  -1.510233 -1.606205 -0.372819
elementType: O N C H
totalener: -615.05809364 hartree
nucrepener: 872.73076356 hartree
electener: -1487.78885721 hartree
oneelecener: -2567.48055585 hartree
twoeener: 1079.69169864 hartree
cpcmener: -0.02811002 hartree
kineticenergy: 612.20400742 hartree
xcener: -59.914528096579 hartree
chargesum: -0.0000000
charge: -0.337575 -0.567195 -0.245117 -0.220357 -0.110535 -0.075595 -0.057759 -0.207370 -0.204402 0.019322 -0.083012 0.507588 -0.273846 0.078009 0.075499 0.093536 0.074461 0.106946 0.097401 0.172203 0.099978 0.101553 0.079570 0.078822 0.102832 0.099199 0.095992 0.108461 0.063421 0.067980 0.097421 0.083957 0.078610
qa: -0.3376 -0.5672 -0.2451 -0.2204 -0.1105 -0.0756 -0.0578 -0.2074 -0.2044 0.0193 -0.0830 0.5076 -0.2738 0.0780 0.0755 0.0935 0.0745 0.1069 0.0974 0.1722 0.1000 0.1016 0.0796 0.0788 0.1028 0.0992 0.0960 0.1085 0.0634 0.0680 0.0974 0.0840 0.0786
va: 2.0647 1.9227 2.9144 3.1845 3.8254 3.9589 3.9134 3.9448 3.9423 3.8559 3.8782 4.3248 3.9381 1.0095 1.0150 1.0048 0.9958 0.9996 1.0199 1.0166 0.9938 0.9941 0.9927 0.9932 0.9936 0.9944 1.0181 0.9999 1.0118 1.0148 1.0069 1.0057 0.9956
dispcorr: -0.013336573 hartree
energy: -615.071430214369
dipole: 8.17537 -7.78944 0.38593 -9.32258 9.29541 -0.02717 -0.15631 1.90716 1.75084
magnitude: 1.79308 au
magnitude: 4.55764 debye
