program: Orca
programVersion: 5.0.2
elementType: O O N N C C C C C C C C C H H H H H H H H H H H H H H H H H H H H
charge: 0
multiplicity: 1
keywords: wb97x-d3
keywords: def2-TZVPP
keywords: def2/J RIJCOSX
keywords: DEFGRID2
keywords: scfconv7
keywords: smallprint printgap noloewdin
keywords: NOSOSCF
formula: C9H20N2O2
InChI: InChI=1/C9H20N2O2/c1-4-8-13-9(12)10-6-5-7-11(2)3/h10H,4-8H2,1-3H3
33 atoms
O  -2.044356 -0.47048 0.50501
O  -0.93855 0.447892 -1.236671
N  3.473153 -0.975103 0.248368
N  -0.416043 0.963621 0.917468
C  2.07526 0.985523 0.900887
C  2.26135 -0.212372 -0.016357
C  0.776604 1.739978 0.649481
C  4.660266 -0.216694 -0.096277
C  3.449429 -2.20132 -0.524348
C  -2.996207 -1.088329 -0.369705
C  -4.105514 -0.144281 -0.788752
C  -1.111612 0.32414 -0.035071
C  -4.861908 0.463411 0.382648
H  2.107262 0.66116 1.944802
H  2.888329 1.703684 0.771646
H  2.225663 0.125138 -1.066956
H  1.418341 -0.894681 0.117072
H  0.751221 2.624864 1.285656
H  0.735793 2.100091 -0.377504
H  -0.601852 0.723325 1.87972
H  4.758303 0.671455 0.526577
H  4.673731 0.108185 -1.148155
H  5.550279 -0.823653 0.072759
H  4.336522 -2.798964 -0.311303
H  3.417769 -2.030989 -1.611377
H  2.577688 -2.800567 -0.258636
H  -3.405458 -1.912009 0.21563
H  -2.494995 -1.519153 -1.238014
H  -3.709596 0.644083 -1.432727
H  -4.791521 -0.726803 -1.409147
H  -5.276528 -0.310065 1.031768
H  -4.223973 1.103349 0.993006
H  -5.691941 1.076663 0.031457
elementType: O N C H
totalener: -615.06025107 hartree
nucrepener: 853.68931063 hartree
electener: -1468.74956170 hartree
oneelecener: -2529.40768030 hartree
twoeener: 1060.65811860 hartree
cpcmener: -0.02676786 hartree
kineticenergy: 612.20653309 hartree
xcener: -59.910847734821 hartree
chargesum: -0.0000000
charge: -0.346303 -0.572658 -0.230312 -0.230050 -0.063243 -0.125032 -0.057931 -0.198588 -0.193827 0.019916 -0.103800 0.522817 -0.266080 0.061775 0.073104 0.068798 0.091985 0.109633 0.097630 0.175798 0.101248 0.077564 0.101082 0.100528 0.077208 0.098195 0.111619 0.102615 0.066306 0.075865 0.080843 0.079988 0.093306
qa: -0.3463 -0.5727 -0.2303 -0.2301 -0.0632 -0.1250 -0.0579 -0.1986 -0.1938 0.0199 -0.1038 0.5228 -0.2661 0.0618 0.0731 0.0688 0.0920 0.1096 0.0976 0.1758 0.1012 0.0776 0.1011 0.1005 0.0772 0.0982 0.1116 0.1026 0.0663 0.0759 0.0808 0.0800 0.0933
va: 2.0507 1.9202 2.9093 3.1822 3.7773 3.9582 3.9047 3.9279 3.9275 3.8521 3.8641 4.3000 3.9256 1.0281 1.0227 1.0134 1.0008 1.0024 1.0186 1.0142 0.9948 1.0048 0.9944 0.9950 1.0030 0.9977 0.9969 1.0172 1.0223 1.0131 1.0013 1.0089 1.0042
dispcorr: -0.012071647 hartree
energy: -615.072322721380
dipole: 4.67794 -4.77630 -0.09836 -1.43365 1.51433 0.08068 -0.57558 1.61755 1.04198
magnitude: 1.04971 au
magnitude: 2.66816 debye
