program: Orca
programVersion: 5.0.2
elementType: O O N N C C C C C C C C C H H H H H H H H H H H H H H H H H H H H
charge: 0
multiplicity: 1
keywords: wb97x-d3
keywords: def2-TZVPP
keywords: def2/J RIJCOSX
keywords: DEFGRID2
keywords: scfconv7
keywords: smallprint printgap noloewdin
keywords: NOSOSCF
formula: C9H20N2O2
InChI: InChI=1/C9H20N2O2/c1-4-8-13-9(12)10-6-5-7-11(2)3/h10H,4-8H2,1-3H3
33 atoms
O  -2.135058 0.016429 1.003074
O  -1.454968 2.004076 0.174901
N  2.871506 -1.0607 -0.02681
N  -0.007839 0.586767 1.203722
C  1.684257 1.08553 -0.561755
C  1.951152 -0.3696 -0.916221
C  1.193306 1.320516 0.860819
C  4.179517 -0.438099 -0.026214
C  2.987597 -2.4458 -0.435075
C  -3.474515 0.23309 0.542429
C  -3.648119 -0.02878 -0.94083
C  -1.213095 0.947407 0.734614
C  -3.138671 -1.391464 -1.384565
H  2.577987 1.695078 -0.715601
H  0.944114 1.464003 -1.271094
H  2.308297 -0.404841 -1.960116
H  1.002965 -0.915245 -0.907864
H  1.958902 1.035956 1.58026
H  1.015352 2.384622 1.015712
H  0.100881 -0.361731 1.527748
H  4.634668 -0.384635 -1.027561
H  4.857893 -1.00302 0.61424
H  4.136031 0.575172 0.37249
H  3.391509 -2.567567 -1.451886
H  2.011198 -2.931745 -0.407958
H  3.643919 -2.987594 0.247347
H  -3.811592 1.236983 0.807898
H  -4.070163 -0.476166 1.117343
H  -4.720046 0.048184 -1.141228
H  -3.173467 0.758812 -1.528473
H  -3.585386 -2.196041 -0.797357
H  -3.385654 -1.57272 -2.430638
H  -2.054799 -1.472594 -1.290977
elementType: O N C H
totalener: -615.05849397 hartree
nucrepener: 870.45480916 hartree
electener: -1485.51330313 hartree
oneelecener: -2562.73561994 hartree
twoeener: 1077.22231680 hartree
cpcmener: -0.02416229 hartree
kineticenergy: 612.20763774 hartree
xcener: -59.911834297592 hartree
chargesum: -0.0000000
charge: -0.341849 -0.571029 -0.240881 -0.235457 -0.118241 -0.111975 -0.065537 -0.196133 -0.194760 0.019300 -0.112149 0.530074 -0.262701 0.083696 0.086488 0.089189 0.093140 0.105447 0.101828 0.176816 0.081308 0.100692 0.094059 0.074473 0.098834 0.100158 0.104340 0.111993 0.078126 0.067912 0.082471 0.093471 0.076899
qa: -0.3418 -0.5710 -0.2409 -0.2355 -0.1182 -0.1120 -0.0655 -0.1961 -0.1948 0.0193 -0.1121 0.5301 -0.2627 0.0837 0.0865 0.0892 0.0931 0.1054 0.1018 0.1768 0.0813 0.1007 0.0941 0.0745 0.0988 0.1002 0.1043 0.1120 0.0781 0.0679 0.0825 0.0935 0.0769
va: 2.0521 1.9244 2.8623 3.1738 3.7865 3.9046 3.9097 3.9406 3.9281 3.8542 3.8562 4.2980 3.9307 1.0109 1.0229 1.0119 1.0019 1.0076 1.0158 1.0172 1.0039 0.9963 0.9942 1.0032 0.9956 0.9965 1.0141 0.9967 1.0128 1.0225 1.0015 1.0047 1.0051
dispcorr: -0.012931896 hartree
energy: -615.071425868874
dipole: 7.58551 -6.95286 0.63265 -7.99700 6.66524 -1.33176 -7.35851 7.28283 -0.07568
magnitude: 1.47634 au
magnitude: 3.75255 debye
