program: Orca
programVersion: 5.0.2
elementType: O O N N C C C C C C C C C H H H H H H H H H H H H H H H H H H H H
charge: 0
multiplicity: 1
keywords: wb97x-d3
keywords: def2-TZVPP
keywords: def2/J RIJCOSX
keywords: DEFGRID2
keywords: scfconv7
keywords: smallprint printgap noloewdin
keywords: NOSOSCF
formula: C9H20N2O2
InChI: InChI=1/C9H20N2O2/c1-4-8-13-9(12)10-6-5-7-11(2)3/h10H,4-8H2,1-3H3
33 atoms
O  -2.00766 0.776256 -1.003081
O  -1.12649 1.352003 0.994837
N  2.872919 -1.433073 0.001559
N  -0.001667 1.698823 -0.953999
C  2.324745 0.945433 -0.526786
C  1.965802 -0.318826 0.238742
C  1.28279 2.047682 -0.38357
C  2.36106 -2.618233 0.660693
C  4.20565 -1.149842 0.497397
C  -3.204665 0.299911 -0.379187
C  -3.052392 -1.087263 0.213472
C  -1.04222 1.274085 -0.219644
C  -4.378096 -1.569608 0.783229
H  3.273768 1.35677 -0.175033
H  2.457318 0.71428 -1.587655
H  0.969646 -0.651262 -0.065418
H  1.896878 -0.080099 1.314835
H  1.140109 2.309518 0.66366
H  1.646225 2.947892 -0.880225
H  -0.018836 1.50456 -1.944614
H  2.290119 -2.51153 1.754043
H  3.005937 -3.473455 0.455236
H  1.365145 -2.859693 0.286917
H  4.85338 -2.011212 0.331729
H  4.226649 -0.920468 1.573867
H  4.654406 -0.309361 -0.030288
H  -3.942385 0.282783 -1.181759
H  -3.553985 1.012901 0.371176
H  -2.707545 -1.776964 -0.560749
H  -2.294729 -1.084711 0.999062
H  -4.279633 -2.566994 1.210536
H  -4.736541 -0.907574 1.57309
H  -5.150929 -1.615064 0.014199
elementType: O N C H
totalener: -615.06028297 hartree
nucrepener: 856.95723750 hartree
electener: -1472.01752047 hartree
oneelecener: -2535.81452784 hartree
twoeener: 1063.79700737 hartree
cpcmener: -0.02637618 hartree
kineticenergy: 612.20323267 hartree
xcener: -59.909950873584 hartree
chargesum: -0.0000000
charge: -0.340459 -0.569325 -0.227874 -0.232732 -0.066223 -0.123674 -0.055093 -0.193451 -0.198153 0.032179 -0.093452 0.515884 -0.274490 0.073220 0.066104 0.089593 0.069487 0.097324 0.107035 0.174004 0.076972 0.100660 0.097880 0.100911 0.077698 0.100904 0.112103 0.091185 0.064874 0.064802 0.093943 0.084675 0.083490
qa: -0.3405 -0.5693 -0.2279 -0.2327 -0.0662 -0.1237 -0.0551 -0.1935 -0.1982 0.0322 -0.0935 0.5159 -0.2745 0.0732 0.0661 0.0896 0.0695 0.0973 0.1070 0.1740 0.0770 0.1007 0.0979 0.1009 0.0777 0.1009 0.1121 0.0912 0.0649 0.0648 0.0939 0.0847 0.0835
va: 2.0676 1.9221 2.9072 3.1891 3.7806 3.9593 3.9060 3.9288 3.9273 3.8393 3.8572 4.3061 3.9502 1.0203 1.0266 1.0006 1.0101 1.0209 1.0022 1.0151 1.0037 0.9951 0.9976 0.9947 1.0041 0.9948 0.9998 1.0138 1.0116 1.0256 1.0022 1.0007 1.0015
dispcorr: -0.012004691 hartree
energy: -615.072287659185
dipole: 4.67283 -4.32335 0.34948 -10.03922 9.82574 -0.21348 3.73205 -4.71817 -0.98612
magnitude: 1.06778 au
magnitude: 2.71407 debye
