program: Gaussian 09
title: 000065987
version: EM64L-G09RevD.01
frameworkgroup: C1[X(C21H26Cl2N2O4)]
method: RPBEPBE
basis: SDD
operation: Freq
keyword: #p
keyword: freq=noraman
keyword: PBEPBE/SDD
title: #p freq=noraman PBEPBE/SDD
converged: YES YES NO NO
title: Mulliken charges:
elementType: Cl Cl O O O O N N C C C C C C C C C C C C C C C C C C C C C H H H H H H H H H H H H H H H H H H H H H H H H H H
charge: -0.046895 -0.043773 -0.314407 -0.292919 -0.402945 -0.266476 -0.085088 -0.437567 0.466292 -0.515049 -0.514202 -0.514349 -0.459204 -0.459948 -0.447667 -0.417152 -0.485545 0.164694 -0.173847 -0.382183 -0.510242 0.147784 0.231601 0.310993 -0.331886 -0.319575 -0.094128 -0.075656 -0.227468 0.226084 0.200700 0.206298 0.213495 0.207516 0.225401 0.224894 0.213397 0.230666 0.210860 0.213280 0.220667 0.224907 0.262941 0.301062 0.215979 0.306562 0.231984 0.229833 0.356956 0.293177 0.259931 0.305210 0.251708 0.378148 0.285153
chargesum: 0.00000
title: Mulliken charges with hydrogens summed into heavy atoms:
elementType: Cl Cl O O O O N N C C C C C C C C C C C C C C C C C C C C C
charge: -0.046895 -0.043773 -0.314407 -0.292919 -0.024798 -0.266476 -0.085088 -0.080611 0.466292 -0.088265 -0.094409 -0.081433 -0.020913 -0.018422 -0.013720 0.070696 0.031497 0.164694 0.132715 0.079633 0.042865 0.147784 0.231601 0.310993 -0.026676 -0.067868 -0.094128 -0.075656 0.057685
polarizability: 3.46217102e+02 1.37358736e+01 2.49590869e+02 -1.16528963e+01 3.68925389e+01 2.27052671e+02
1716.lowfreq: 0.0005 0.0013 0.0025 2.7435 4.5537 6.7575 7.1794 15.2603 25.9537
frequency: 7.0156 14.7610 25.9422 39.2132 42.3191 44.4048 57.6876 62.2850 75.8485 85.2888 103.3968 113.6837 121.7745 130.6331 146.2742 157.8600 176.5939 183.4534 192.5355 200.4593 220.7461 239.8072 246.7286 282.9931 299.3682 314.3447 336.7950 357.9072 364.7910 388.1410 392.2321 410.1612 415.4834 425.7290 451.9902 466.4417 474.0487 490.6122 501.0586 513.0725 519.2807 558.0940 589.0348 599.5383 623.7357 633.2261 640.9920 654.1597 669.0117 697.7608 698.6716 714.8127 733.9738 752.3454 781.5477 788.8937 797.5223 805.8086 809.0616 838.5478 870.2709 877.9468 880.7462 892.3415 902.7471 929.4676 934.7506 944.9454 955.9490 969.0752 979.7082 981.4031 994.1371 1001.7303 1013.0057 1034.2741 1044.4341 1048.6488 1055.0535 1067.9491 1085.7676 1091.4978 1109.8283 1110.3646 1114.2291 1143.8200 1154.1429 1157.2210 1177.8296 1186.0367 1194.7923 1196.8353 1211.9461 1223.7889 1234.1904 1239.9381 1246.2025 1260.6508 1266.2807 1272.0624 1276.0165 1279.3996 1296.3848 1302.3768 1314.2015 1325.7125 1328.8246 1337.5059 1344.5931 1347.9380 1350.4493 1373.7787 1377.8929 1378.5237 1403.0039 1418.8691 1435.1820 1435.5182 1450.8229 1456.0579 1460.5455 1463.7024 1470.3064 1474.8170 1475.2451 1479.6148 1493.9392 1505.1138 1551.8464 1576.4809 1591.5760 1596.0098 1649.3931 2967.8688 2973.2499 2975.1995 2979.0860 2981.2689 2984.1145 2996.6462 3002.1094 3012.0311 3012.1494 3033.6395 3035.6590 3043.3023 3044.8729 3047.0933 3053.6799 3065.3635 3077.0289 3079.0189 3090.2611 3093.4228 3168.4762 3175.7568 3185.3010 3415.0926 3517.8055
redmass: 12.7855 5.9540 7.6528 4.5589 4.9479 4.0087 3.5185 5.0180 9.1660 3.1017 7.4268 5.0189 5.8157 5.6290 5.7172 4.0335 6.6468 4.2546 6.1882 4.5459 4.1524 2.8398 2.5730 3.7212 3.0002 3.8730 13.1952 2.7138 4.6440 3.1456 3.1050 6.8667 2.9801 2.0868 3.5529 4.0698 3.4482 1.8988 4.3024 4.5964 4.6033 3.6761 3.7047 3.5598 2.5076 1.6135 2.2469 2.7316 4.6379 2.3064 3.6872 1.4380 4.2802 10.2089 2.6964 1.7448 3.6793 1.5432 1.6429 2.9935 1.5364 1.4877 2.6158 3.7179 2.3537 2.7008 1.4218 2.4504 2.1630 2.0342 2.2536 4.8055 1.5813 2.5436 2.1564 2.3605 1.9351 2.0596 2.5712 1.8964 3.1329 1.4563 1.8730 2.3396 1.9395 2.7416 2.4838 2.3069 1.2127 1.4013 1.3706 1.3554 1.3863 1.1971 1.3983 1.8935 1.4959 1.3653 1.4026 1.5617 1.3068 1.4076 1.5915 1.4219 1.3454 1.6062 1.4595 1.4023 1.4860 1.5055 1.3569 1.4080 10.4684 1.9461 3.0149 2.6573 1.1392 2.6759 1.0921 1.1279 1.0877 1.0821 1.1762 1.3474 1.1227 1.3955 1.1060 1.1125 8.0803 6.8680 6.2147 7.3193 7.8364 1.0703 1.0612 1.0625 1.0627 1.0650 1.0614 1.0620 1.0627 1.0671 1.0630 1.0982 1.1005 1.0982 1.0847 1.1001 1.1039 1.0991 1.1045 1.0966 1.0951 1.0936 1.0923 1.0927 1.0940 1.0767 1.0640
irintensity: 0.0121 0.1075 0.6953 0.5556 0.6796 0.3465 0.2853 0.4488 0.9634 0.3379 2.9061 7.1536 1.9152 1.5339 0.1864 2.6416 0.3477 2.9275 6.6060 0.5568 1.5685 1.5386 1.1499 1.8433 1.5338 2.9267 1.7586 8.1681 45.1832 4.2752 0.2668 2.8561 4.1333 1.7837 5.7965 12.7129 28.2317 36.9647 0.9162 1.8462 7.8238 24.4447 5.4416 18.9832 4.6160 84.0952 47.8058 2.3975 13.0346 16.0665 54.2597 91.2675 33.1729 91.5554 5.5132 9.9874 7.0404 0.2098 0.4381 7.2144 40.4686 3.8991 0.5349 3.3898 8.0459 2.0233 11.0827 20.2140 10.4579 9.6343 11.6479 4.2712 8.0672 11.7167 16.5576 8.8292 3.7005 11.5362 257.7096 1.2435 53.9889 7.4777 20.9146 33.8362 2.8552 4.1750 45.7567 7.2635 0.7277 6.8821 5.5073 0.7276 3.5943 6.4425 21.2966 17.2783 38.2705 1.5704 45.6943 5.5817 2.7045 1.2507 99.6036 4.3189 3.3120 12.6179 0.7086 50.1629 12.1299 8.7239 1.8395 7.1340 0.2088 38.2037 38.1227 208.9464 17.5198 98.9895 4.8217 40.3610 6.6420 16.5960 106.9538 220.8849 54.6772 247.7627 6.3800 43.0100 296.6797 126.3613 46.6916 25.6246 259.5202 24.1475 6.0679 29.8345 26.2600 75.7715 22.3439 30.9088 16.4782 53.0778 24.2097 33.8732 32.5861 26.0684 3.5715 54.6591 8.3658 16.0716 106.6512 14.8343 3.8368 9.9121 1.4441 7.4671 0.9963 159.5048 31.0032
temp: 298.150 k
press: 1.00000 atm
elementType: 17 17 8 8 8 8 7 7 6 6 6 6 6 6 6 6 6 6 6 6 6 6 6 6 6 6 6 6 6 1 1 1 1 1 1 1 1 1 1 1 1 1 1 1 1 1 1 1 1 1 1 1 1 1 1
symmnumber: 1
zpe: 1157788.1 jmol-1
zpe.correction: 0.440978 hartree
zpe.thermalcorrener: 0.469333 hartree
zpe.thermalcorrenthalpy: 0.470277 hartree
zpe.thermalcorrgfe: 0.377526 hartree
zpe.sumelectzpe: -2144.229248 hartree
zpe.sumelectthermal: -2144.200893 hartree
zpe.sumelectthermalent: -2144.199949 hartree
zpe.sumelectthermalfe: -2144.292700 hartree
dipole: 5.0504 0.6853 -1.1237
dipole: 5.2191
quadrupole: -177.4922 -186.3306 -185.3131
quadrupole: -1.0365 2.0254 -6.5216
quadrupole: 5.5531 -3.2853 -2.2678 -1.0365 2.0254 -6.5216
hfenergy: -2144.670226 hartree
pointgroup: C01 [X(C21H26Cl2N2O4)]
dipole: 1.951902 -0.5997966 0.2158554 debye
polarizability: 343.5418146|-26.44245|207.9629114|3.138682|19.5467819|271.3559162 unknown
InChI: InChI=1S/C21H26Cl2N2O4/c22-15-11-14(12-16(23)13-15)19(28)24-17(3-4-18(26)27)20(29)25-9-7-21(8-10-25)5-1-2-6-21/h11-13,17,24,26H,1-10H2
charge 0 multiplicity 1
55 atoms
Cl -5.887368 1.884002 2.86179
Cl -6.713404 1.627352 -2.623567
O  0.236309 0.456842 2.378819
O  -2.04782 -0.80968 -1.634924
O  -0.79233 -4.106976 -2.552694
O  1.002493 -2.77829 -1.941722
N  2.16916 -0.141771 1.220293
N  -1.433591 -0.42424 0.572176
C  4.620013 1.205486 0.22607
C  5.27039 2.370789 -0.575919
C  5.880691 0.382506 0.640706
C  3.79947 1.726121 1.435433
C  3.67604 0.370954 -0.692208
C  6.41602 1.718733 -1.399354
C  6.849638 0.453901 -0.58026
C  3.031787 0.604483 2.170085
C  2.903896 -0.728493 0.07318
C  0.807836 -0.149854 1.40358
C  -0.071789 -0.956984 0.414767
C  0.013065 -2.478121 0.752639
C  -0.718307 -3.377018 -0.261631
C  -2.312507 -0.330124 -0.481275
C  -0.066772 -3.356868 -1.630297
C  -3.627553 0.372674 -0.218015
C  -4.439155 0.634786 -1.350215
C  -4.068853 0.754656 1.075494
C  -5.313028 1.398555 1.202718
C  -5.670789 1.283113 -1.171454
C  -6.139204 1.680867 0.097364
H  4.538568 2.906504 -1.209176
H  5.687899 3.108101 0.139162
H  6.346518 0.864278 1.523508
H  5.652115 -0.660093 0.928955
H  4.472351 2.23201 2.155715
H  3.066594 2.481606 1.087861
H  4.252114 -0.10644 -1.507303
H  2.942255 1.051517 -1.168466
H  6.054235 1.42464 -2.401546
H  7.254762 2.419833 -1.555826
H  7.901092 0.520275 -0.248528
H  6.770508 -0.457166 -1.201231
H  3.741956 -0.110125 2.633187
H  2.381091 1.013186 2.959401
H  2.222356 -1.261146 -0.60711
H  3.614849 -1.482269 0.470461
H  0.236189 -0.803411 -0.633656
H  -0.419274 -2.632636 1.758626
H  1.076554 -2.775499 0.8027
H  -1.553419 0.088774 1.457945
H  -1.773692 -3.081186 -0.387972
H  -0.730008 -4.426791 0.091418
H  -4.080796 0.31705 -2.333266
H  -3.483537 0.547856 1.975532
H  -0.362681 -4.037647 -3.448074
H  -7.10244 2.181778 0.219604
