program: Orca
programVersion: 5.0.2
elementType: O O N N C C C C C C C C C H H H H H H H H H H H H H H H H H H H H
charge: 0
multiplicity: 1
keywords: wb97x-d3
keywords: def2-TZVPP
keywords: def2/J RIJCOSX
keywords: DEFGRID2
keywords: scfconv7
keywords: smallprint printgap noloewdin
keywords: NOSOSCF
formula: C9H20N2O2
InChI: InChI=1/C9H20N2O2/c1-4-8-13-9(12)10-6-5-7-11(2)3/h10H,4-8H2,1-3H3
33 atoms
O  -1.442196 0.019993 -0.317209
O  -0.508563 1.221473 1.340701
N  1.748798 -0.830213 0.330096
N  0.130243 1.486008 -0.831577
C  2.613135 1.35604 -0.556129
C  2.669633 0.279516 0.521338
C  1.352332 2.213836 -0.570061
C  2.112391 -1.659236 -0.796683
C  1.641364 -1.620867 1.535492
C  -2.315833 -0.621333 0.614089
C  -3.18911 -1.590603 -0.151087
C  -0.579178 0.919649 0.164464
C  -4.08203 -0.932792 -1.192472
H  3.458193 2.030273 -0.390197
H  2.775229 0.925428 -1.548318
H  2.442744 0.744385 1.485127
H  3.709603 -0.08493 0.599009
H  1.244375 2.743409 0.376299
H  1.455229 2.981306 -1.33952
H  0.058797 1.050227 -1.739098
H  1.391645 -2.471032 -0.90973
H  3.112458 -2.113303 -0.69858
H  2.100315 -1.090852 -1.72718
H  1.278226 -1.005854 2.360653
H  2.595108 -2.074886 1.851797
H  0.926492 -2.433193 1.39099
H  -2.933296 0.122849 1.12573
H  -1.73224 -1.152084 1.371104
H  -2.566118 -2.359553 -0.616284
H  -3.806539 -2.106079 0.589035
H  -3.505749 -0.472171 -1.995514
H  -4.747219 -1.665575 -1.650669
H  -4.707812 -0.157315 -0.745944
elementType: O N C H
totalener: -615.06023579 hartree
nucrepener: 904.10736235 hartree
electener: -1519.16759814 hartree
oneelecener: -2630.59642030 hartree
twoeener: 1111.42882216 hartree
cpcmener: -0.02103927 hartree
kineticenergy: 612.19974880 hartree
xcener: -59.910071035146 hartree
chargesum: 0.0000000
charge: -0.327721 -0.531900 -0.226384 -0.213329 -0.141584 -0.084726 -0.022266 -0.197983 -0.201070 0.012428 -0.099844 0.473643 -0.256682 0.079946 0.075303 0.090904 0.078597 0.089210 0.102358 0.158490 0.098342 0.081028 0.097478 0.094590 0.088144 0.097753 0.099931 0.106263 0.063918 0.065499 0.080331 0.090819 0.078516
qa: -0.3277 -0.5319 -0.2264 -0.2133 -0.1416 -0.0847 -0.0223 -0.1980 -0.2011 0.0124 -0.0998 0.4736 -0.2567 0.0799 0.0753 0.0909 0.0786 0.0892 0.1024 0.1585 0.0983 0.0810 0.0975 0.0946 0.0881 0.0978 0.0999 0.1063 0.0639 0.0655 0.0803 0.0908 0.0785
va: 2.0483 1.9741 2.8749 3.1744 3.8760 3.8521 3.8684 3.9334 3.9038 3.8527 3.9447 4.4052 3.9172 1.0203 1.0096 1.0052 1.0167 1.0235 1.0034 1.0236 0.9966 1.0078 0.9940 1.0046 1.0075 0.9935 1.0021 0.9962 1.0129 1.0116 1.0102 1.0046 1.0028
dispcorr: -0.014424521 hartree
energy: -615.074660314496
dipole: 2.33794 -1.77462 0.56332 -8.08618 7.39611 -0.69006 -2.25640 1.02528 -1.23112
magnitude: 1.51959 au
magnitude: 3.86250 debye
