program: Orca
programVersion: 5.0.2
elementType: O O N N C C C C C C C C C H H H H H H H H H H H H H H H H H H H H
charge: 0
multiplicity: 1
keywords: wb97x-d3
keywords: def2-TZVPP
keywords: def2/J RIJCOSX
keywords: DEFGRID2
keywords: scfconv7
keywords: smallprint printgap noloewdin
keywords: NOSOSCF
formula: C9H20N2O2
InChI: InChI=1/C9H20N2O2/c1-4-8-13-9(12)10-6-5-7-11(2)3/h10H,4-8H2,1-3H3
33 atoms
O  -1.400103 0.252262 0.50777
O  -0.473422 1.242989 -1.285751
N  1.734899 -0.883584 -0.131377
N  0.299562 1.633118 0.82255
C  2.757129 1.326678 0.455558
C  2.692497 0.144579 -0.504993
C  1.548354 2.25589 0.438266
C  2.162297 -1.640923 1.021752
C  1.446854 -1.762504 -1.240253
C  -2.395935 -0.351484 -0.320263
C  -3.296419 -1.187235 0.56318
C  -0.501715 1.043523 -0.085685
C  -4.413611 -1.825764 -0.248762
H  2.947548 0.990323 1.478704
H  3.627535 1.929843 0.181995
H  3.70617 -0.281008 -0.612253
H  2.419864 0.518654 -1.49576
H  1.731669 3.087868 1.120862
H  1.423729 2.693909 -0.551647
H  0.253982 1.272839 1.764343
H  1.394656 -2.366048 1.298139
H  2.315677 -0.995089 1.88661
H  3.099466 -2.197331 0.854853
H  1.051223 -1.194579 -2.08319
H  0.690341 -2.494803 -0.951219
H  2.325152 -2.323795 -1.599765
H  -1.924974 -0.977289 -1.08354
H  -2.977373 0.420331 -0.832693
H  -2.707957 -1.963666 1.058912
H  -3.7252 -0.560105 1.34906
H  -5.054555 -2.439847 0.383848
H  -5.045574 -1.07172 -0.721452
H  -4.020054 -2.468892 -1.037957
elementType: O N C H
totalener: -615.06042069 hartree
nucrepener: 896.43595955 hartree
electener: -1511.49638024 hartree
oneelecener: -2615.19562715 hartree
twoeener: 1103.69924691 hartree
cpcmener: -0.02084996 hartree
kineticenergy: 612.20314757 hartree
xcener: -59.910629772387 hartree
chargesum: 0.0000000
charge: -0.326130 -0.533231 -0.230251 -0.208551 -0.138032 -0.080592 -0.024859 -0.197615 -0.199488 0.030928 -0.082521 0.468884 -0.277372 0.074291 0.079079 0.078715 0.090081 0.102493 0.090535 0.156991 0.098149 0.098045 0.078596 0.092827 0.098140 0.088926 0.091153 0.095435 0.063565 0.063633 0.092764 0.082833 0.082579
qa: -0.3261 -0.5332 -0.2303 -0.2086 -0.1380 -0.0806 -0.0249 -0.1976 -0.1995 0.0309 -0.0825 0.4689 -0.2774 0.0743 0.0791 0.0787 0.0901 0.1025 0.0905 0.1570 0.0981 0.0980 0.0786 0.0928 0.0981 0.0889 0.0912 0.0954 0.0636 0.0636 0.0928 0.0828 0.0826
va: 2.0562 1.9710 2.8716 3.1782 3.8736 3.8528 3.8680 3.9384 3.9005 3.8502 3.9214 4.4087 3.9538 1.0109 1.0208 1.0162 1.0057 1.0032 1.0239 1.0246 0.9963 0.9941 1.0080 1.0062 0.9933 1.0074 0.9928 1.0023 1.0104 1.0107 1.0036 1.0014 1.0009
dispcorr: -0.014040175 hartree
energy: -615.074460861487
dipole: 1.41424 -0.86801 0.54623 -9.74281 9.16404 -0.57878 0.51557 0.74340 1.25897
magnitude: 1.48941 au
magnitude: 3.78579 debye
