program: Orca
programVersion: 5.0.2
elementType: O O N N C C C C C C C C C H H H H H H H H H H H H H H H H H H H H
charge: 0
multiplicity: 1
keywords: wb97x-d3
keywords: def2-TZVPP
keywords: def2/J RIJCOSX
keywords: DEFGRID2
keywords: scfconv7
keywords: smallprint printgap noloewdin
keywords: NOSOSCF
formula: C9H20N2O2
InChI: InChI=1/C9H20N2O2/c1-4-8-13-9(12)10-6-5-7-11(2)3/h10H,4-8H2,1-3H3
33 atoms
O  -1.380381 0.248104 0.528271
O  -0.485426 1.289469 -1.253603
N  1.699365 -0.86845 -0.17567
N  0.315746 1.631097 0.8529
C  2.764838 1.310219 0.452981
C  2.678056 0.147064 -0.528763
C  1.564886 2.251068 0.466078
C  2.097923 -1.644233 0.975718
C  1.408131 -1.730304 -1.297565
C  -2.37734 -0.352588 -0.300816
C  -3.240035 -1.237327 0.572535
C  -0.495614 1.059662 -0.05896
C  -4.352674 -1.885184 -0.238244
H  2.96192 0.95231 1.467569
H  3.639157 1.908722 0.181744
H  3.683387 -0.296256 -0.641927
H  2.414007 0.544401 -1.512835
H  1.763578 3.068868 1.161367
H  1.433015 2.708384 -0.514126
H  0.282442 1.246433 1.785549
H  1.312967 -2.357265 1.234695
H  2.250867 -1.009133 1.848624
H  3.027057 -2.21606 0.816069
H  2.281336 -2.300983 -1.655008
H  1.030126 -1.146205 -2.137874
H  0.637339 -2.453701 -1.02438
H  -1.907129 -0.942779 -1.09238
H  -2.986096 0.421325 -0.777315
H  -2.621292 -2.010142 1.036241
H  -3.672276 -0.644729 1.38307
H  -3.954803 -2.493051 -1.052835
H  -4.962927 -2.53664 0.387392
H  -5.015679 -1.137538 -0.677401
elementType: O N C H
totalener: -615.06031776 hartree
nucrepener: 898.58049241 hartree
electener: -1513.64081017 hartree
oneelecener: -2619.47332671 hartree
twoeener: 1105.83251653 hartree
cpcmener: -0.02093855 hartree
kineticenergy: 612.20048438 hartree
xcener: -59.910294561526 hartree
chargesum: 0.0000000
charge: -0.325498 -0.531777 -0.229226 -0.207910 -0.139504 -0.081155 -0.024727 -0.198368 -0.200362 0.027914 -0.082392 0.467211 -0.277400 0.074630 0.079638 0.078261 0.090558 0.102292 0.090231 0.156330 0.098374 0.098097 0.079852 0.089455 0.093640 0.097610 0.090725 0.097715 0.063593 0.063941 0.082721 0.092691 0.082839
qa: -0.3255 -0.5318 -0.2292 -0.2079 -0.1395 -0.0812 -0.0247 -0.1984 -0.2004 0.0279 -0.0824 0.4672 -0.2774 0.0746 0.0796 0.0783 0.0906 0.1023 0.0902 0.1563 0.0984 0.0981 0.0799 0.0895 0.0936 0.0976 0.0907 0.0977 0.0636 0.0639 0.0827 0.0927 0.0828
va: 2.0555 1.9727 2.8717 3.1770 3.8741 3.8539 3.8690 3.9371 3.9006 3.8510 3.9211 4.4123 3.9539 1.0102 1.0207 1.0162 1.0052 1.0032 1.0241 1.0249 0.9962 0.9942 1.0080 1.0075 1.0057 0.9931 0.9926 1.0021 1.0104 1.0106 1.0009 1.0036 1.0015
dispcorr: -0.014188627 hartree
energy: -615.074506390776
dipole: 1.42554 -0.85067 0.57487 -9.95602 9.31451 -0.64151 0.33417 0.90694 1.24110
magnitude: 1.51074 au
magnitude: 3.84001 debye
