program: Orca
programVersion: 5.0.2
elementType: O O N N C C C C C C C C C H H H H H H H H H H H H H H H H H H H H
charge: 0
multiplicity: 1
keywords: wb97x-d3
keywords: def2-TZVPP
keywords: def2/J RIJCOSX
keywords: DEFGRID2
keywords: scfconv7
keywords: smallprint printgap noloewdin
keywords: NOSOSCF
formula: C9H20N2O2
InChI: InChI=1/C9H20N2O2/c1-4-8-13-9(12)10-6-5-7-11(2)3/h10H,4-8H2,1-3H3
33 atoms
O  -1.58198 0.417538 0.304149
O  -0.465814 1.394703 -1.386639
N  1.519186 -0.908625 -0.173992
N  0.18042 1.663575 0.782618
C  2.631781 1.203717 0.588585
C  2.571958 0.063484 -0.421256
C  1.491139 2.212563 0.510448
C  1.786816 -1.724648 0.987775
C  1.287911 -1.735217 -1.335613
C  -2.542823 -0.112933 -0.611746
C  -3.444895 -1.059391 0.148297
C  -0.59183 1.159721 -0.199614
C  -2.727471 -2.283828 0.696332
H  2.711907 0.818684 1.609148
H  3.560124 1.754267 0.411889
H  3.56053 -0.427577 -0.459955
H  2.411437 0.491276 -1.41489
H  1.67561 3.012121 1.230503
H  1.470166 2.684243 -0.47167
H  0.045123 1.274222 1.703907
H  1.891964 -1.114751 1.88535
H  2.701933 -2.332141 0.891677
H  0.954721 -2.409057 1.163567
H  0.463203 -2.425402 -1.146891
H  2.161941 -2.340582 -1.628087
H  1.011994 -1.118755 -2.192439
H  -2.041442 -0.643153 -1.425935
H  -3.125422 0.702049 -1.0499
H  -3.952697 -0.522094 0.954055
H  -4.227327 -1.373505 -0.547224
H  -3.430967 -2.964989 1.176297
H  -2.228075 -2.838373 -0.101177
H  -1.973732 -2.019792 1.438824
elementType: O N C H
totalener: -615.06020426 hartree
nucrepener: 911.56117566 hartree
electener: -1526.62137992 hartree
oneelecener: -2645.46359288 hartree
twoeener: 1118.84221296 hartree
cpcmener: -0.02080892 hartree
kineticenergy: 612.20463309 hartree
xcener: -59.911019063144 hartree
chargesum: 0.0000000
charge: -0.326650 -0.533047 -0.226138 -0.210664 -0.138057 -0.083546 -0.023676 -0.196683 -0.195421 0.005221 -0.088216 0.473411 -0.263993 0.074274 0.079003 0.078432 0.090200 0.102210 0.089581 0.156736 0.098959 0.081429 0.094429 0.093593 0.088457 0.093226 0.095118 0.111800 0.062558 0.065343 0.096395 0.077056 0.078658
qa: -0.3266 -0.5330 -0.2261 -0.2107 -0.1381 -0.0835 -0.0237 -0.1967 -0.1954 0.0052 -0.0882 0.4734 -0.2640 0.0743 0.0790 0.0784 0.0902 0.1022 0.0896 0.1567 0.0990 0.0814 0.0944 0.0936 0.0885 0.0932 0.0951 0.1118 0.0626 0.0653 0.0964 0.0771 0.0787
va: 2.0511 1.9719 2.8734 3.1759 3.8748 3.8573 3.8678 3.9366 3.9044 3.8574 3.9264 4.4056 3.9186 1.0107 1.0209 1.0162 1.0055 1.0032 1.0244 1.0248 0.9938 1.0092 0.9942 0.9943 1.0079 1.0056 0.9960 1.0034 1.0136 1.0118 1.0065 1.0030 1.0082
dispcorr: -0.015083371 hartree
energy: -615.075287626862
dipole: 3.36800 -2.94126 0.42675 -11.06696 10.39612 -0.67084 2.12758 -0.86150 1.26608
magnitude: 1.49502 au
magnitude: 3.80004 debye
