program: Orca
programVersion: 5.0.2
elementType: O O N N C C C C C C C C C H H H H H H H H H H H H H H H H H H H H
charge: 0
multiplicity: 1
keywords: wb97x-d3
keywords: def2-TZVPP
keywords: def2/J RIJCOSX
keywords: DEFGRID2
keywords: scfconv7
keywords: smallprint printgap noloewdin
keywords: NOSOSCF
formula: C9H20N2O2
InChI: InChI=1/C9H20N2O2/c1-4-8-13-9(12)10-6-5-7-11(2)3/h10H,4-8H2,1-3H3
33 atoms
O  -1.72712 0.096481 0.947831
O  -1.597932 2.152728 0.015244
N  2.124654 -1.143852 0.025176
N  0.260781 0.938022 0.493774
C  2.609051 1.298502 -0.049959
C  2.752335 -0.059753 -0.729237
C  1.19662 1.861945 -0.114231
C  2.957386 -1.594538 1.119681
C  1.746021 -2.248237 -0.829963
C  -3.140197 0.033916 0.747917
C  -3.500803 -0.473199 -0.634698
C  -1.060123 1.145441 0.439657
C  -2.900665 -1.832636 -0.9584
H  2.948878 1.249412 0.98821
H  3.271682 2.007816 -0.550194
H  3.814692 -0.276054 -0.917696
H  2.27447 -0.005545 -1.711251
H  1.163926 2.826586 0.397969
H  0.931801 2.049638 -1.160673
H  0.613793 -0.013612 0.60986
H  3.907267 -2.035316 0.780296
H  2.429549 -2.349055 1.705251
H  3.196243 -0.770941 1.793367
H  1.23793 -3.01638 -0.244171
H  2.601032 -2.724187 -1.332959
H  1.052808 -1.906859 -1.6005
H  -3.604011 1.002278 0.945699
H  -3.496412 -0.661433 1.509713
H  -4.592087 -0.530746 -0.677052
H  -3.207758 0.259338 -1.391165
H  -1.809991 -1.805598 -0.976225
H  -3.200847 -2.585631 -0.226686
H  -3.229498 -2.180297 -1.938338
elementType: O N C H
totalener: -615.06163996 hartree
nucrepener: 883.52984517 hartree
electener: -1498.59148512 hartree
oneelecener: -2588.92642676 hartree
twoeener: 1090.33494164 hartree
cpcmener: -0.01994914 hartree
kineticenergy: 612.21798932 hartree
xcener: -59.914503248432 hartree
chargesum: -0.0000000
charge: -0.340548 -0.546462 -0.238982 -0.271935 -0.148450 -0.078240 -0.024828 -0.193652 -0.198437 0.019375 -0.104142 0.501137 -0.251319 0.079739 0.081218 0.081816 0.093240 0.097442 0.086412 0.186126 0.084720 0.102577 0.103189 0.103999 0.094881 0.097428 0.098366 0.105032 0.072654 0.066782 0.070071 0.079151 0.091640
qa: -0.3405 -0.5465 -0.2390 -0.2719 -0.1484 -0.0782 -0.0248 -0.1937 -0.1984 0.0194 -0.1041 0.5011 -0.2513 0.0797 0.0812 0.0818 0.0932 0.0974 0.0864 0.1861 0.0847 0.1026 0.1032 0.1040 0.0949 0.0974 0.0984 0.1050 0.0727 0.0668 0.0701 0.0792 0.0916
va: 2.0427 1.9660 2.9405 3.1094 3.9344 3.8707 3.8941 3.9249 3.9113 3.8669 3.8657 4.3268 3.9293 1.0139 1.0174 1.0121 0.9992 1.0016 1.0050 1.0811 1.0064 0.9964 0.9939 0.9950 1.0018 0.9935 1.0184 0.9972 1.0145 1.0210 1.0055 1.0024 1.0054
dispcorr: -0.013291317 hartree
energy: -615.074931274014
dipole: 6.42786 -5.07769 1.35017 -10.63571 9.06835 -1.56736 -4.38424 4.14452 -0.23972
magnitude: 2.08255 au
magnitude: 5.29342 debye
