program: Orca
programVersion: 5.0.2
elementType: O O N N C C C C C C C C C H H H H H H H H H H H H H H H H H H H H
charge: 0
multiplicity: 1
keywords: wb97x-d3
keywords: def2-TZVPP
keywords: def2/J RIJCOSX
keywords: DEFGRID2
keywords: scfconv7
keywords: smallprint printgap noloewdin
keywords: NOSOSCF
formula: C9H20N2O2
InChI: InChI=1/C9H20N2O2/c1-4-8-13-9(12)10-6-5-7-11(2)3/h10H,4-8H2,1-3H3
33 atoms
O  -2.558461 0.118166 -0.177113
O  -1.166256 1.186932 1.236169
N  4.161235 -0.924281 -0.076608
N  -0.504123 0.56741 -0.849888
C  1.772501 -0.246065 -0.305618
C  3.228029 0.182831 -0.184014
C  0.888307 0.927464 -0.713144
C  3.962844 -1.699069 1.12819
C  5.524193 -0.447617 -0.152522
C  -3.614632 0.159535 0.7866
C  -4.794521 -0.597265 0.218524
C  -1.384991 0.661825 0.16063
C  -5.355973 -0.005312 -1.065214
H  1.690454 -1.038601 -1.055472
H  1.401989 -0.654488 0.638212
H  3.328796 0.88371 0.66485
H  3.497893 0.751418 -1.080271
H  0.970821 1.738166 0.011107
H  1.225148 1.331433 -1.67007
H  -0.77086 0.032993 -1.66309
H  4.687128 -2.514537 1.166611
H  2.972061 -2.153129 1.14636
H  4.077931 -1.109078 2.052022
H  5.803313 0.225427 0.674379
H  5.683754 0.094792 -1.086305
H  6.219568 -1.288883 -0.139748
H  -3.889748 1.198031 0.995703
H  -3.287652 -0.298172 1.72384
H  -4.517616 -1.643856 0.06502
H  -5.567345 -0.597493 0.991479
H  -5.649113 1.037449 -0.926782
H  -4.63704 -0.042027 -1.884364
H  -6.241685 -0.5538 -1.387803
elementType: O N C H
totalener: -615.06319243 hartree
nucrepener: 820.70595640 hartree
electener: -1435.76914883 hartree
oneelecener: -2463.14338120 hartree
twoeener: 1027.37423237 hartree
cpcmener: -0.02194959 hartree
kineticenergy: 612.19599291 hartree
xcener: -59.906184118890 hartree
chargesum: 0.0000000
charge: -0.330824 -0.543335 -0.231266 -0.242889 -0.068633 -0.112307 -0.039736 -0.195259 -0.190473 0.021482 -0.101632 0.515775 -0.255292 0.062624 0.072742 0.070473 0.081617 0.089278 0.102642 0.170982 0.099078 0.099546 0.076620 0.074745 0.097071 0.098776 0.097023 0.102934 0.063287 0.065202 0.078323 0.080515 0.090914
qa: -0.3308 -0.5433 -0.2313 -0.2429 -0.0686 -0.1123 -0.0397 -0.1953 -0.1905 0.0215 -0.1016 0.5158 -0.2553 0.0626 0.0727 0.0705 0.0816 0.0893 0.1026 0.1710 0.0991 0.0995 0.0766 0.0747 0.0971 0.0988 0.0970 0.1029 0.0633 0.0652 0.0783 0.0805 0.0909
va: 2.0664 1.9634 2.9055 3.1920 3.8021 3.9463 3.8823 3.9321 3.9340 3.8504 3.9489 4.3022 3.9142 1.0299 1.0196 1.0074 1.0003 1.0223 1.0031 1.0170 0.9950 0.9937 1.0031 1.0027 0.9959 0.9949 0.9983 1.0041 1.0136 1.0115 1.0029 1.0102 1.0045
dispcorr: -0.010811940 hartree
energy: -615.074004367676
dipole: 6.39052 -6.44528 -0.05477 -4.14590 3.60929 -0.53661 -0.87388 -0.05921 -0.93309
magnitude: 1.07778 au
magnitude: 2.73950 debye
