program: Orca
programVersion: 5.0.2
elementType: O O N N C C C C C C C C C H H H H H H H H H H H H H H H H H H H H
charge: 0
multiplicity: 1
keywords: wb97x-d3
keywords: def2-TZVPP
keywords: def2/J RIJCOSX
keywords: DEFGRID2
keywords: scfconv7
keywords: smallprint printgap noloewdin
keywords: NOSOSCF
formula: C9H20N2O2
InChI: InChI=1/C9H20N2O2/c1-4-8-13-9(12)10-6-5-7-11(2)3/h10H,4-8H2,1-3H3
33 atoms
O  -2.067376 0.135717 -0.460916
O  -1.276198 1.566175 1.08926
N  3.905569 -0.873418 0.194013
N  -0.043355 0.980984 -0.728224
C  2.176315 0.910169 0.407035
C  2.757624 -0.228365 -0.418986
C  1.147749 1.720227 -0.372566
C  4.557729 -1.750684 -0.752583
C  3.552642 -1.599422 1.394058
C  -3.329112 0.080833 0.209578
C  -4.218573 -0.887682 -0.538714
C  -1.132956 0.94135 0.05479
C  -5.600119 -0.951965 0.094973
H  1.716817 0.544758 1.328996
H  2.985198 1.584759 0.701078
H  3.086491 0.183359 -1.378466
H  1.967274 -0.962964 -0.654068
H  0.854301 2.597306 0.203133
H  1.59298 2.092148 -1.297353
H  -0.020376 0.398888 -1.550695
H  3.92034 -2.579813 -1.100251
H  5.45165 -2.189805 -0.306083
H  4.874327 -1.188531 -1.633063
H  4.441765 -2.068933 1.818321
H  2.808422 -2.394111 1.221002
H  3.151363 -0.9308 2.155887
H  -3.783386 1.075788 0.230289
H  -3.195529 -0.247199 1.243938
H  -4.307057 -0.575596 -1.582532
H  -3.763162 -1.88129 -0.539057
H  -6.096664 0.019775 0.071362
H  -6.2399 -1.659275 -0.432772
H  -5.548959 -1.271626 1.137365
elementType: O N C H
totalener: -615.06292870 hartree
nucrepener: 828.49106023 hartree
electener: -1443.55398893 hartree
oneelecener: -2478.58375994 hartree
twoeener: 1035.02977101 hartree
cpcmener: -0.02230596 hartree
kineticenergy: 612.20548440 hartree
xcener: -59.908448393709 hartree
chargesum: -0.0000000
charge: -0.330017 -0.543791 -0.234270 -0.234682 -0.069569 -0.101674 -0.075667 -0.189224 -0.194458 0.035860 -0.084564 0.515168 -0.275477 0.069795 0.066743 0.086280 0.065923 0.099899 0.106350 0.176772 0.073819 0.098136 0.096721 0.098998 0.074808 0.100850 0.091275 0.090957 0.062666 0.064401 0.082625 0.093302 0.082047
qa: -0.3300 -0.5438 -0.2343 -0.2347 -0.0696 -0.1017 -0.0757 -0.1892 -0.1945 0.0359 -0.0846 0.5152 -0.2755 0.0698 0.0667 0.0863 0.0659 0.0999 0.1064 0.1768 0.0738 0.0981 0.0967 0.0990 0.0748 0.1009 0.0913 0.0910 0.0627 0.0644 0.0826 0.0933 0.0820
va: 2.0694 1.9615 2.9099 3.1725 3.7724 3.9153 3.9191 3.9325 3.9324 3.8515 3.9215 4.3033 3.9518 1.0244 1.0308 0.9998 1.0179 1.0215 1.0005 1.0138 1.0022 0.9951 0.9964 0.9945 1.0045 0.9931 0.9987 1.0001 1.0105 1.0101 1.0014 1.0036 1.0014
dispcorr: -0.010918957 hartree
energy: -615.073847654538
dipole: 3.28069 -3.23254 0.04815 -8.64327 7.70097 -0.94230 -0.64741 -0.65642 -1.30383
magnitude: 1.60942 au
magnitude: 4.09081 debye
