program: Orca
programVersion: 5.0.2
elementType: O O N N C C C C C C C C C H H H H H H H H H H H H H H H H H H H H
charge: 0
multiplicity: 1
keywords: wb97x-d3
keywords: def2-TZVPP
keywords: def2/J RIJCOSX
keywords: DEFGRID2
keywords: scfconv7
keywords: smallprint printgap noloewdin
keywords: NOSOSCF
formula: C9H20N2O2
InChI: InChI=1/C9H20N2O2/c1-4-8-13-9(12)10-6-5-7-11(2)3/h10H,4-8H2,1-3H3
33 atoms
O  -2.095562 0.102512 -0.441149
O  -1.262449 1.500815 1.11647
N  3.957023 -0.839409 0.165214
N  -0.059057 0.91444 -0.719563
C  2.182068 0.897992 0.381617
C  2.766718 -0.252308 -0.425474
C  1.12775 1.675662 -0.39624
C  4.587613 -1.74871 -0.766006
C  3.677585 -1.510825 1.415365
C  -3.34838 0.05218 0.246984
C  -4.304825 -0.777082 -0.581882
C  -1.141811 0.886499 0.073259
C  -5.67319 -0.848538 0.079226
H  1.746758 0.548924 1.321376
H  2.984901 1.593435 0.642304
H  3.046633 0.133117 -1.41128
H  1.989915 -1.016981 -0.603568
H  0.832617 2.560616 0.166994
H  1.553187 2.034913 -1.335369
H  -0.057766 0.349732 -1.554263
H  3.958367 -2.611895 -1.037075
H  5.514674 -2.139349 -0.342361
H  4.84461 -1.226281 -1.689418
H  2.944546 -2.328142 1.318214
H  3.297718 -0.812734 2.161514
H  4.596483 -1.939537 1.818882
H  -3.744857 1.062179 0.381987
H  -3.215354 -0.39091 1.238069
H  -4.400281 -0.337817 -1.578367
H  -3.903745 -1.785327 -0.713698
H  -6.109438 0.144073 0.205219
H  -6.366636 -1.436064 -0.522662
H  -5.619973 -1.313568 1.065209
elementType: O N C H
totalener: -615.06291847 hartree
nucrepener: 827.15257694 hartree
electener: -1442.21549541 hartree
oneelecener: -2475.93156701 hartree
twoeener: 1033.71607159 hartree
cpcmener: -0.02228778 hartree
kineticenergy: 612.20188052 hartree
xcener: -59.907752175621 hartree
chargesum: -0.0000000
charge: -0.330425 -0.543887 -0.234162 -0.233506 -0.068043 -0.100605 -0.078592 -0.189826 -0.194763 0.035101 -0.085124 0.515868 -0.275372 0.068986 0.066977 0.085858 0.065299 0.100418 0.106664 0.177257 0.073923 0.098254 0.096690 0.075293 0.100581 0.098983 0.088745 0.094128 0.062878 0.064452 0.082394 0.092920 0.082636
qa: -0.3304 -0.5439 -0.2342 -0.2335 -0.0680 -0.1006 -0.0786 -0.1898 -0.1948 0.0351 -0.0851 0.5159 -0.2754 0.0690 0.0670 0.0859 0.0653 0.1004 0.1067 0.1773 0.0739 0.0983 0.0967 0.0753 0.1006 0.0990 0.0887 0.0941 0.0629 0.0645 0.0824 0.0929 0.0826
va: 2.0692 1.9611 2.9102 3.1708 3.7681 3.9145 3.9219 3.9329 3.9325 3.8521 3.9227 4.3020 3.9517 1.0240 1.0305 0.9996 1.0177 1.0211 1.0002 1.0134 1.0024 0.9952 0.9964 1.0040 0.9932 0.9945 1.0006 0.9981 1.0106 1.0099 1.0014 1.0035 1.0016
dispcorr: -0.010903514 hartree
energy: -615.073821986907
dipole: 3.29608 -3.28931 0.00677 -8.15679 7.25235 -0.90444 -0.72107 -0.59360 -1.31467
magnitude: 1.59575 au
magnitude: 4.05607 debye
