program: Orca
programVersion: 5.0.2
elementType: O O N N C C C C C C C C C H H H H H H H H H H H H H H H H H H H H
charge: 0
multiplicity: 1
keywords: wb97x-d3
keywords: def2-TZVPP
keywords: def2/J RIJCOSX
keywords: DEFGRID2
keywords: scfconv7
keywords: smallprint printgap noloewdin
keywords: NOSOSCF
formula: C9H20N2O2
InChI: InChI=1/C9H20N2O2/c1-4-8-13-9(12)10-6-5-7-11(2)3/h10H,4-8H2,1-3H3
33 atoms
O  -1.720453 0.617114 0.729078
O  -0.736844 1.38478 -1.151225
N  1.425709 -0.963699 -0.260661
N  0.205681 1.675114 0.900966
C  2.605022 1.152733 0.412298
C  2.432785 0.029215 -0.602197
C  1.482278 2.182398 0.45498
C  1.814892 -1.76931 0.875037
C  1.139341 -1.803353 -1.401934
C  -2.85807 0.154858 -0.002734
C  -2.653538 -1.219268 -0.608133
C  -0.7348 1.223374 0.054723
C  -2.323464 -2.29421 0.4162
H  2.778884 0.754392 1.415595
H  3.519909 1.692018 0.151844
H  3.41389 -0.45338 -0.761099
H  2.158026 0.471825 -1.564064
H  1.771851 2.992438 1.127302
H  1.350241 2.63423 -0.528088
H  0.135518 1.392995 1.866774
H  2.757404 -2.318516 0.715568
H  1.038913 -2.504978 1.092596
H  1.936053 -1.160397 1.77118
H  0.768425 -1.201334 -2.232728
H  0.368319 -2.533497 -1.150062
H  2.016759 -2.364508 -1.763537
H  -3.143378 0.880792 -0.766568
H  -3.662844 0.121346 0.733622
H  -3.584495 -1.475094 -1.121706
H  -1.883013 -1.18013 -1.38107
H  -2.255202 -3.274892 -0.055991
H  -1.371461 -2.10735 0.914795
H  -3.093487 -2.356603 1.188171
elementType: O N C H
totalener: -615.05965765 hartree
nucrepener: 918.99293940 hartree
electener: -1534.05259704 hartree
oneelecener: -2660.48411342 hartree
twoeener: 1126.43151638 hartree
cpcmener: -0.02109369 hartree
kineticenergy: 612.20459796 hartree
xcener: -59.912117390271 hartree
chargesum: 0.0000000
charge: -0.333158 -0.538201 -0.224715 -0.211437 -0.134714 -0.089504 -0.026300 -0.199728 -0.210442 0.027701 -0.120356 0.472455 -0.283049 0.074645 0.080289 0.080793 0.089119 0.103380 0.088869 0.161898 0.084216 0.093696 0.100417 0.100098 0.095752 0.092928 0.101246 0.107133 0.082480 0.069664 0.098972 0.073152 0.092703
qa: -0.3332 -0.5382 -0.2247 -0.2114 -0.1347 -0.0895 -0.0263 -0.1997 -0.2104 0.0277 -0.1204 0.4725 -0.2830 0.0746 0.0803 0.0808 0.0891 0.1034 0.0889 0.1619 0.0842 0.0937 0.1004 0.1001 0.0958 0.0929 0.1012 0.1071 0.0825 0.0697 0.0990 0.0732 0.0927
va: 2.0494 1.9616 2.8628 3.1726 3.8727 3.8613 3.8670 3.9341 3.9087 3.8490 3.8607 4.4017 3.9221 1.0117 1.0198 1.0157 1.0054 1.0028 1.0238 1.0232 1.0096 0.9930 0.9936 0.9983 0.9897 1.0100 1.0177 0.9977 1.0157 1.0164 1.0012 1.0068 1.0064
dispcorr: -0.015769420 hartree
energy: -615.075427066052
dipole: 4.73648 -4.14087 0.59561 -11.39140 10.89079 -0.50061 -0.03296 1.22475 1.19178
magnitude: 1.42327 au
magnitude: 3.61767 debye
