program: Orca
programVersion: 5.0.2
elementType: O O N N C C C C C C C C C H H H H H H H H H H H H H H H H H H H H
charge: 0
multiplicity: 1
keywords: wb97x-d3
keywords: def2-TZVPP
keywords: def2/J RIJCOSX
keywords: DEFGRID2
keywords: scfconv7
keywords: smallprint printgap noloewdin
keywords: NOSOSCF
formula: C9H20N2O2
InChI: InChI=1/C9H20N2O2/c1-4-8-13-9(12)10-6-5-7-11(2)3/h10H,4-8H2,1-3H3
33 atoms
O  -2.487246 0.198907 -0.526993
O  -1.219231 0.928068 1.188784
N  4.28429 -0.89793 0.006594
N  -0.355823 0.626114 -0.89538
C  1.893725 -0.24463 -0.300528
C  3.324696 0.191243 -0.016474
C  1.014089 0.966216 -0.590491
C  4.035435 -1.831331 1.083247
C  5.632132 -0.380301 0.090245
C  -3.65485 0.186199 0.297706
C  -4.819845 -0.252279 -0.563852
C  -1.336946 0.60532 0.021607
C  -6.115507 -0.271346 0.23294
H  1.883504 -0.918123 -1.162398
H  1.471513 -0.793479 0.544901
H  3.346476 0.770431 0.924453
H  3.636852 0.88348 -0.805123
H  1.025083 1.654428 0.255037
H  1.41655 1.51743 -1.442755
H  -0.557345 0.269394 -1.816599
H  4.076857 -1.368139 2.082555
H  4.779614 -2.629218 1.059921
H  3.058881 -2.304014 0.977381
H  5.829003 0.188338 1.013521
H  5.837211 0.280984 -0.753622
H  6.353889 -1.198011 0.048819
H  -3.83756 1.183562 0.707493
H  -3.517553 -0.50158 1.136869
H  -4.921083 0.426452 -1.414686
H  -4.621919 -1.24735 -0.97096
H  -6.951723 -0.583105 -0.393136
H  -6.060456 -0.964372 1.074372
H  -6.355802 0.715638 0.632308
elementType: O N C H
totalener: -615.06327151 hartree
nucrepener: 812.22330156 hartree
electener: -1427.28657307 hartree
oneelecener: -2446.15390742 hartree
twoeener: 1018.86733435 hartree
cpcmener: -0.02208951 hartree
kineticenergy: 612.19394115 hartree
xcener: -59.905884749571 hartree
chargesum: 0.0000000
charge: -0.329514 -0.543776 -0.230978 -0.237752 -0.064998 -0.114008 -0.046808 -0.195066 -0.190299 0.035894 -0.088208 0.512680 -0.275270 0.062202 0.072616 0.070512 0.081553 0.089960 0.103828 0.171621 0.076591 0.099192 0.099599 0.074488 0.097634 0.098702 0.090407 0.092921 0.063690 0.064454 0.093288 0.082547 0.082298
qa: -0.3295 -0.5438 -0.2310 -0.2378 -0.0650 -0.1140 -0.0468 -0.1951 -0.1903 0.0359 -0.0882 0.5127 -0.2753 0.0622 0.0726 0.0705 0.0816 0.0900 0.1038 0.1716 0.0766 0.0992 0.0996 0.0745 0.0976 0.0987 0.0904 0.0929 0.0637 0.0645 0.0933 0.0825 0.0823
va: 2.0696 1.9618 2.9066 3.1898 3.7961 3.9487 3.8813 3.9312 3.9326 3.8517 3.9251 4.3022 3.9520 1.0304 1.0212 1.0072 1.0002 1.0214 1.0027 1.0178 1.0031 0.9950 0.9940 1.0029 0.9960 0.9948 0.9995 0.9989 1.0102 1.0098 1.0035 1.0015 1.0014
dispcorr: -0.010500464 hartree
energy: -615.073771975225
dipole: 5.36070 -5.34930 0.01140 -4.03564 3.79869 -0.23695 1.30797 -2.38490 -1.07693
magnitude: 1.10275 au
magnitude: 2.80296 debye
