program: Orca
programVersion: 5.0.2
elementType: O O N N C C C C C C C C C H H H H H H H H H H H H H H H H H H H H
charge: 0
multiplicity: 1
keywords: wb97x-d3
keywords: def2-TZVPP
keywords: def2/J RIJCOSX
keywords: DEFGRID2
keywords: scfconv7
keywords: smallprint printgap noloewdin
keywords: NOSOSCF
formula: C9H20N2O2
InChI: InChI=1/C9H20N2O2/c1-4-8-13-9(12)10-6-5-7-11(2)3/h10H,4-8H2,1-3H3
33 atoms
O  -2.512779 0.534898 -0.336787
O  -1.15695 1.213833 1.333011
N  4.218685 -0.781679 0.247989
N  -0.390523 0.925548 -0.78959
C  1.823738 -0.057206 -0.230301
C  3.287863 0.308634 0.028513
C  1.004072 1.193557 -0.524332
C  4.429988 -1.603672 -0.920682
C  3.908908 -1.575145 1.414459
C  -3.651624 0.556297 0.527036
C  -4.809432 -0.067781 -0.220817
C  -1.332502 0.91178 0.16782
C  -4.590345 -1.531906 -0.57318
H  1.74416 -0.742972 -1.079169
H  1.396284 -0.568949 0.636383
H  3.333989 0.970496 0.899912
H  3.66027 0.895917 -0.817643
H  1.074002 1.897081 0.306024
H  1.412293 1.70628 -1.397231
H  -0.640668 0.592358 -1.707676
H  3.56229 -2.21187 -1.216979
H  5.258083 -2.293275 -0.743578
H  4.703017 -0.980315 -1.774401
H  3.78762 -0.929764 2.286697
H  4.732903 -2.259574 1.627131
H  2.997978 -2.184763 1.322285
H  -3.883922 1.587791 0.805856
H  -3.446939 -0.00237 1.444137
H  -5.690313 0.029776 0.418386
H  -5.022583 0.5126 -1.122951
H  -5.472851 -1.952325 -1.056443
H  -3.751695 -1.667416 -1.256976
H  -4.390284 -2.127904 0.319662
elementType: O N C H
totalener: -615.06156375 hartree
nucrepener: 827.42845526 hartree
electener: -1442.49001901 hartree
oneelecener: -2476.55120378 hartree
twoeener: 1034.06118477 hartree
cpcmener: -0.02227843 hartree
kineticenergy: 612.19856515 hartree
xcener: -59.910033810752 hartree
chargesum: -0.0000000
charge: -0.332218 -0.543036 -0.246462 -0.240056 -0.094537 -0.093494 -0.051206 -0.198477 -0.203441 0.017200 -0.099908 0.519569 -0.254636 0.071166 0.075581 0.091220 0.084858 0.089388 0.102780 0.172648 0.076467 0.099271 0.099012 0.101153 0.100317 0.077784 0.108618 0.093414 0.065621 0.062937 0.091001 0.079363 0.078105
qa: -0.3322 -0.5430 -0.2465 -0.2401 -0.0945 -0.0935 -0.0512 -0.1985 -0.2034 0.0172 -0.0999 0.5196 -0.2546 0.0712 0.0756 0.0912 0.0849 0.0894 0.1028 0.1726 0.0765 0.0993 0.0990 0.1012 0.1003 0.0778 0.1086 0.0934 0.0656 0.0629 0.0910 0.0794 0.0781
va: 2.0625 1.9636 2.9048 3.1815 3.7714 3.9403 3.8943 3.9451 3.9433 3.8515 3.9430 4.2946 3.9148 1.0154 1.0162 1.0008 1.0025 1.0216 1.0036 1.0171 0.9926 0.9941 0.9943 0.9929 0.9947 0.9913 1.0012 1.0026 1.0117 1.0134 1.0045 1.0109 1.0030
dispcorr: -0.011236900 hartree
energy: -615.072800649709
dipole: 4.88255 -5.30362 -0.42107 -8.87935 8.32042 -0.55893 -2.18906 0.73614 -1.45292
magnitude: 1.61266 au
magnitude: 4.09907 debye
