program: Orca
programVersion: 5.0.2
elementType: O O N N C C C C C C C C C H H H H H H H H H H H H H H H H H H H H
charge: 0
multiplicity: 1
keywords: wb97x-d3
keywords: def2-TZVPP
keywords: def2/J RIJCOSX
keywords: DEFGRID2
keywords: scfconv7
keywords: smallprint printgap noloewdin
keywords: NOSOSCF
formula: C9H20N2O2
InChI: InChI=1/C9H20N2O2/c1-4-8-13-9(12)10-6-5-7-11(2)3/h10H,4-8H2,1-3H3
33 atoms
O  -1.747292 0.644962 0.668862
O  -0.697961 1.331413 -1.206666
N  1.449745 -0.984034 -0.164049
N  0.191442 1.677514 0.85924
C  2.608465 1.160775 0.443195
C  2.461022 -0.004965 -0.526738
C  1.47576 2.180203 0.430487
C  1.819079 -1.745191 1.007334
C  1.169028 -1.862209 -1.276294
C  -2.872752 0.179438 -0.080469
C  -2.679123 -1.217272 -0.636324
C  -0.73322 1.213651 0.004003
C  -2.395241 -2.266117 0.42781
H  2.776428 0.805731 1.463846
H  3.519925 1.700192 0.170294
H  3.446652 -0.489863 -0.645184
H  2.205905 0.396207 -1.51178
H  1.74274 3.011259 1.086184
H  1.364382 2.602595 -0.567861
H  0.086099 1.445524 1.834943
H  1.039581 -2.473055 1.239535
H  1.921687 -1.101032 1.881341
H  2.765833 -2.29862 0.888447
H  0.393998 -2.580975 -1.003763
H  2.046268 -2.438489 -1.614395
H  0.804803 -1.287849 -2.129654
H  -3.122393 0.885114 -0.875189
H  -3.698286 0.185069 0.633155
H  -3.602424 -1.472679 -1.164049
H  -1.889375 -1.217307 -1.390961
H  -1.457232 -2.075922 0.951028
H  -3.190114 -2.297191 1.176052
H  -2.324263 -3.260638 -0.013897
elementType: O N C H
totalener: -615.05960018 hartree
nucrepener: 917.55942923 hartree
electener: -1532.61902941 hartree
oneelecener: -2657.63022790 hartree
twoeener: 1125.01119849 hartree
cpcmener: -0.02097545 hartree
kineticenergy: 612.20394274 hartree
xcener: -59.912050083250 hartree
chargesum: -0.0000000
charge: -0.334147 -0.540008 -0.224411 -0.210159 -0.132696 -0.089816 -0.028745 -0.198367 -0.208551 0.027248 -0.120521 0.475797 -0.279961 0.074504 0.079811 0.080429 0.088930 0.103615 0.089305 0.162464 0.092929 0.099776 0.083352 0.094613 0.092833 0.098850 0.101263 0.107242 0.082161 0.069647 0.071694 0.092412 0.098506
qa: -0.3341 -0.5400 -0.2244 -0.2102 -0.1327 -0.0898 -0.0287 -0.1984 -0.2086 0.0272 -0.1205 0.4758 -0.2800 0.0745 0.0798 0.0804 0.0889 0.1036 0.0893 0.1625 0.0929 0.0998 0.0834 0.0946 0.0928 0.0989 0.1013 0.1072 0.0822 0.0696 0.0717 0.0924 0.0985
va: 2.0493 1.9597 2.8623 3.1735 3.8707 3.8646 3.8670 3.9356 3.9093 3.8502 3.8618 4.3959 3.9216 1.0112 1.0199 1.0159 1.0051 1.0027 1.0237 1.0231 0.9935 0.9934 1.0092 0.9900 1.0095 0.9987 1.0177 0.9975 1.0155 1.0163 1.0078 1.0060 1.0014
dispcorr: -0.015671050 hartree
energy: -615.075271228520
dipole: 4.60625 -4.06962 0.53663 -11.28022 10.85700 -0.42321 0.47279 0.75507 1.22786
magnitude: 1.40525 au
magnitude: 3.57186 debye
