program: Orca
programVersion: 5.0.2
elementType: O O N N C C C C C C C C C H H H H H H H H H H H H H H H H H H H H
charge: 0
multiplicity: 1
keywords: wb97x-d3
keywords: def2-TZVPP
keywords: def2/J RIJCOSX
keywords: DEFGRID2
keywords: scfconv7
keywords: smallprint printgap noloewdin
keywords: NOSOSCF
formula: C9H20N2O2
InChI: InChI=1/C9H20N2O2/c1-4-8-13-9(12)10-6-5-7-11(2)3/h10H,4-8H2,1-3H3
33 atoms
O  -2.518796 -0.10241 0.053787
O  -1.156952 1.648948 0.452842
N  3.958915 -0.265112 -0.332828
N  -0.383568 -0.271548 -0.485981
C  1.737375 -0.258689 0.803562
C  3.190586 0.194655 0.810068
C  1.016591 0.09012 -0.493496
C  5.26059 0.362501 -0.361789
C  4.083109 -1.705122 -0.366533
C  -3.656677 0.647554 0.487523
C  -4.855932 -0.274401 0.47538
C  -1.332706 0.515354 0.046516
C  -5.196403 -0.837471 -0.896656
H  1.658263 -1.333647 0.989164
H  1.233625 0.231369 1.641259
H  3.655083 -0.116727 1.762574
H  3.210892 1.288623 0.804977
H  1.107837 1.158097 -0.69905
H  1.479089 -0.424665 -1.334618
H  -0.627053 -1.222379 -0.716325
H  5.156034 1.448296 -0.402465
H  5.808516 0.052134 -1.253278
H  5.886445 0.121918 0.512675
H  4.675844 -2.006226 -1.231843
H  3.107887 -2.183493 -0.4673
H  4.567941 -2.123654 0.530625
H  -3.819473 1.496163 -0.183581
H  -3.490041 1.040509 1.493156
H  -4.700726 -1.087285 1.190213
H  -5.700588 0.306475 0.854523
H  -5.355037 -0.040391 -1.625921
H  -4.409074 -1.486856 -1.280907
H  -6.111477 -1.429527 -0.854869
elementType: O N C H
totalener: -615.06314379 hartree
nucrepener: 829.90518446 hartree
electener: -1444.96832825 hartree
oneelecener: -2481.65072462 hartree
twoeener: 1036.68239637 hartree
cpcmener: -0.02131812 hartree
kineticenergy: 612.19966467 hartree
xcener: -59.908222432592 hartree
chargesum: 0.0000000
charge: -0.332107 -0.544791 -0.245645 -0.244060 -0.116142 -0.101199 -0.030664 -0.191768 -0.190573 0.020616 -0.101118 0.518166 -0.254726 0.073282 0.086673 0.083809 0.091607 0.091407 0.096502 0.172271 0.097955 0.098471 0.071664 0.099197 0.094094 0.079987 0.097273 0.102594 0.063243 0.065152 0.078174 0.080119 0.090534
qa: -0.3321 -0.5448 -0.2456 -0.2441 -0.1161 -0.1012 -0.0307 -0.1918 -0.1906 0.0206 -0.1011 0.5182 -0.2547 0.0733 0.0867 0.0838 0.0916 0.0914 0.0965 0.1723 0.0980 0.0985 0.0717 0.0992 0.0941 0.0800 0.0973 0.1026 0.0632 0.0652 0.0782 0.0801 0.0905
va: 2.0650 1.9610 2.8639 3.1843 3.8318 3.9049 3.8395 3.9342 3.9332 3.8530 3.9474 4.3001 3.9146 1.0117 1.0240 1.0099 0.9996 1.0202 1.0220 1.0173 0.9968 0.9956 1.0007 0.9972 0.9924 1.0050 0.9981 1.0042 1.0135 1.0118 1.0029 1.0105 1.0046
dispcorr: -0.011360475 hartree
energy: -615.074504261050
dipole: 6.68356 -6.55507 0.12849 -5.46813 3.99952 -1.46861 -0.49334 0.40307 -0.09027
magnitude: 1.47698 au
magnitude: 3.75419 debye
