program: Orca
programVersion: 5.0.2
elementType: O O N N C C C C C C C C C H H H H H H H H H H H H H H H H H H H H
charge: 0
multiplicity: 1
keywords: wb97x-d3
keywords: def2-TZVPP
keywords: def2/J RIJCOSX
keywords: DEFGRID2
keywords: scfconv7
keywords: smallprint printgap noloewdin
keywords: NOSOSCF
formula: C9H20N2O2
InChI: InChI=1/C9H20N2O2/c1-4-8-13-9(12)10-6-5-7-11(2)3/h10H,4-8H2,1-3H3
33 atoms
O  -2.542583 -0.025816 -0.41434
O  -1.119006 1.717534 -0.53111
N  3.935299 -0.480667 -0.064708
N  -0.384711 -0.430846 -0.641387
C  1.62581 0.024991 0.73716
C  3.096179 0.417046 0.709932
C  1.031696 -0.134438 -0.655766
C  4.007146 -1.803125 0.515052
C  5.258904 0.073792 -0.233738
C  -3.66501 0.854301 -0.31955
C  -4.894576 0.015483 -0.050932
C  -1.32681 0.517898 -0.523425
C  -4.852417 -0.733112 1.272805
H  1.473081 -0.893937 1.309232
H  1.085871 0.809181 1.273868
H  3.45788 0.514139 1.74886
H  3.178355 1.41323 0.265013
H  1.202594 0.76854 -1.243809
H  1.524316 -0.946078 -1.18911
H  -0.663239 -1.395168 -0.547847
H  3.022801 -2.270081 0.559031
H  4.425059 -1.811061 1.534751
H  4.63663 -2.446006 -0.102894
H  5.201482 1.049581 -0.719393
H  5.861771 -0.575266 -0.87187
H  5.805972 0.206556 0.713913
H  -3.778626 1.411952 -1.252876
H  -3.515705 1.576241 0.48772
H  -5.748005 0.69826 -0.059605
H  -5.054783 -0.681198 -0.878314
H  -5.788238 -1.26537 1.447089
H  -4.050194 -1.471174 1.302549
H  -4.704885 -0.048436 2.110563
elementType: O N C H
totalener: -615.06333218 hartree
nucrepener: 831.14141286 hartree
electener: -1446.20474503 hartree
oneelecener: -2484.12579879 hartree
twoeener: 1037.92105375 hartree
cpcmener: -0.02134789 hartree
kineticenergy: 612.20641789 hartree
xcener: -59.909582548381 hartree
chargesum: -0.0000000
charge: -0.331812 -0.546061 -0.247529 -0.244054 -0.120465 -0.095808 -0.029008 -0.190517 -0.191145 0.017634 -0.100360 0.519523 -0.255195 0.072923 0.087085 0.083600 0.091185 0.091285 0.096123 0.172983 0.095540 0.078686 0.099015 0.097467 0.098027 0.071576 0.107327 0.093958 0.065347 0.063417 0.090827 0.079926 0.078498
qa: -0.3318 -0.5461 -0.2475 -0.2441 -0.1205 -0.0958 -0.0290 -0.1905 -0.1911 0.0176 -0.1004 0.5195 -0.2552 0.0729 0.0871 0.0836 0.0912 0.0913 0.0961 0.1730 0.0955 0.0787 0.0990 0.0975 0.0980 0.0716 0.1073 0.0940 0.0653 0.0634 0.0908 0.0799 0.0785
va: 2.0646 1.9599 2.8652 3.1832 3.8289 3.9014 3.8388 3.9336 3.9343 3.8527 3.9449 4.2976 3.9150 1.0124 1.0256 1.0105 0.9996 1.0191 1.0235 1.0174 0.9927 1.0060 0.9966 0.9971 0.9954 1.0008 1.0015 1.0017 1.0114 1.0133 1.0046 1.0104 1.0029
dispcorr: -0.011378478 hartree
energy: -615.074710654493
dipole: 6.85384 -6.80711 0.04673 -4.97349 3.58292 -1.39057 5.66967 -5.20949 0.46018
magnitude: 1.46549 au
magnitude: 3.72497 debye
