program: Orca
programVersion: 5.0.2
elementType: O O N N C C C C C C C C C H H H H H H H H H H H H H H H H H H H H
charge: 0
multiplicity: 1
keywords: wb97x-d3
keywords: def2-TZVPP
keywords: def2/J RIJCOSX
keywords: DEFGRID2
keywords: scfconv7
keywords: smallprint printgap noloewdin
keywords: NOSOSCF
formula: C9H20N2O2
InChI: InChI=1/C9H20N2O2/c1-4-8-13-9(12)10-6-5-7-11(2)3/h10H,4-8H2,1-3H3
33 atoms
O  -2.48141 -0.026165 -0.25182
O  -1.123146 0.792389 1.350842
N  4.365593 -0.442899 0.257041
N  -0.436506 0.597675 -0.806411
C  1.89188 -0.064637 -0.219345
C  3.300352 0.500828 -0.020189
C  0.920433 1.048011 -0.595488
C  4.185304 -1.171455 1.490979
C  4.658438 -1.324534 -0.84851
C  -3.54927 -0.165215 0.69012
C  -4.774068 -0.647038 -0.056145
C  -1.324687 0.476335 0.19331
C  -5.283925 0.329648 -1.105534
H  1.889894 -0.821165 -1.009595
H  1.542826 -0.553816 0.694216
H  3.273357 1.226905 0.799239
H  3.583431 1.065638 -0.914942
H  0.919354 1.824332 0.171338
H  1.2498 1.528851 -1.518195
H  -0.681548 0.235837 -1.714935
H  3.371039 -1.910926 1.469271
H  3.980422 -0.479386 2.310005
H  5.101661 -1.710788 1.74107
H  3.879399 -2.073134 -1.05703
H  5.582906 -1.872032 -0.652057
H  4.811978 -0.745196 -1.761022
H  -3.753009 0.794449 1.172991
H  -3.269846 -0.880663 1.467792
H  -4.571192 -1.62114 -0.509739
H  -5.549939 -0.817615 0.694411
H  -5.504642 1.304459 -0.665868
H  -4.562426 0.483174 -1.908691
H  -6.203012 -0.03829 -1.56317
elementType: O N C H
totalener: -615.06170453 hartree
nucrepener: 825.83549113 hartree
electener: -1440.89719566 hartree
oneelecener: -2473.41289307 hartree
twoeener: 1032.51569741 hartree
cpcmener: -0.02227974 hartree
kineticenergy: 612.19691884 hartree
xcener: -59.909677335638 hartree
chargesum: 0.0000000
charge: -0.332694 -0.544229 -0.247650 -0.241592 -0.096793 -0.090616 -0.052360 -0.203369 -0.198988 0.018077 -0.100291 0.522104 -0.254818 0.070144 0.076163 0.090622 0.084762 0.091015 0.102994 0.174071 0.078031 0.100882 0.100417 0.076293 0.099513 0.099100 0.093614 0.107436 0.063541 0.065599 0.078249 0.079831 0.090944
qa: -0.3327 -0.5442 -0.2477 -0.2416 -0.0968 -0.0906 -0.0524 -0.2034 -0.1990 0.0181 -0.1003 0.5221 -0.2548 0.0701 0.0762 0.0906 0.0848 0.0910 0.1030 0.1741 0.0780 0.1009 0.1004 0.0763 0.0995 0.0991 0.0936 0.1074 0.0635 0.0656 0.0782 0.0798 0.0909
va: 2.0650 1.9616 2.9053 3.1826 3.7605 3.9372 3.8955 3.9436 3.9449 3.8532 3.9455 4.2910 3.9143 1.0161 1.0189 1.0013 1.0024 1.0188 1.0040 1.0165 0.9916 0.9931 0.9946 0.9926 0.9940 0.9940 1.0007 1.0022 1.0133 1.0113 1.0030 1.0105 1.0045
dispcorr: -0.011250102 hartree
energy: -615.072954634167
dipole: 4.46537 -4.88530 -0.41992 -4.44560 3.82926 -0.61634 -2.71683 1.30771 -1.40912
magnitude: 1.59431 au
magnitude: 4.05242 debye
