program: Orca
programVersion: 5.0.2
elementType: O O N N C C C C C C C C C H H H H H H H H H H H H H H H H H H H H
charge: 0
multiplicity: 1
keywords: wb97x-d3
keywords: def2-TZVPP
keywords: def2/J RIJCOSX
keywords: DEFGRID2
keywords: scfconv7
keywords: smallprint printgap noloewdin
keywords: NOSOSCF
formula: C9H20N2O2
InChI: InChI=1/C9H20N2O2/c1-4-8-13-9(12)10-6-5-7-11(2)3/h10H,4-8H2,1-3H3
33 atoms
O  -1.280867 -0.564608 -0.574664
O  -0.718496 0.909405 1.034526
N  1.957788 -0.780635 0.382631
N  0.069177 1.107069 -1.093068
C  2.501316 1.457853 -0.606482
C  2.639346 0.490898 0.564087
C  1.11534 2.0639 -0.803216
C  1.827454 -1.487903 1.635489
C  2.600645 -1.612034 -0.608654
C  -2.184966 -1.235045 0.30683
C  -3.529318 -0.541312 0.417853
C  -0.63006 0.508015 -0.1107
C  -4.229275 -0.342642 -0.918818
H  3.191043 2.288743 -0.431286
H  2.836065 0.993642 -1.538295
H  2.231365 0.970143 1.45913
H  3.714235 0.335868 0.768908
H  0.825625 2.634426 0.079301
H  1.154388 2.777188 -1.629116
H  0.157076 0.597722 -1.960169
H  1.278246 -2.419602 1.48452
H  1.265467 -0.888606 2.353639
H  2.792763 -1.747366 2.100755
H  2.041335 -2.540824 -0.736581
H  3.637175 -1.88162 -0.346536
H  2.626927 -1.12133 -1.582119
H  -1.729726 -1.370109 1.291078
H  -2.310388 -2.226004 -0.134638
H  -4.149208 -1.164668 1.06874
H  -3.419871 0.416323 0.93284
H  -5.217034 0.098584 -0.777615
H  -3.672035 0.324674 -1.577962
H  -4.366411 -1.290632 -1.444779
elementType: O N C H
totalener: -615.05939698 hartree
nucrepener: 906.15488613 hartree
electener: -1521.21428310 hartree
oneelecener: -2634.82789098 hartree
twoeener: 1113.61360787 hartree
cpcmener: -0.02022870 hartree
kineticenergy: 612.19210947 hartree
xcener: -59.909488231060 hartree
chargesum: -0.0000000
charge: -0.338689 -0.535080 -0.227001 -0.205060 -0.141649 -0.080341 -0.021061 -0.197905 -0.196736 0.024670 -0.109309 0.466255 -0.264844 0.078802 0.075335 0.089354 0.078247 0.089173 0.102832 0.158019 0.098715 0.092157 0.087282 0.098271 0.079313 0.097151 0.100479 0.108433 0.073533 0.067594 0.092014 0.080785 0.079264
qa: -0.3387 -0.5351 -0.2270 -0.2051 -0.1416 -0.0803 -0.0211 -0.1979 -0.1967 0.0247 -0.1093 0.4663 -0.2648 0.0788 0.0753 0.0894 0.0782 0.0892 0.1028 0.1580 0.0987 0.0922 0.0873 0.0983 0.0793 0.0972 0.1005 0.1084 0.0735 0.0676 0.0920 0.0808 0.0793
va: 2.0390 1.9660 2.8811 3.1694 3.8815 3.8518 3.8650 3.9042 3.9349 3.8569 3.8756 4.4180 3.9266 1.0209 1.0099 1.0058 1.0163 1.0239 1.0027 1.0242 0.9937 1.0060 1.0067 0.9968 1.0081 0.9943 1.0134 0.9960 1.0118 1.0220 1.0045 1.0087 1.0013
dispcorr: -0.014610335 hartree
energy: -615.074007310796
dipole: 2.62612 -1.93606 0.69006 -4.52934 4.00344 -0.52590 -0.10917 -0.95434 -1.06351
magnitude: 1.37251 au
magnitude: 3.48865 debye
