program: Orca
programVersion: 5.0.2
elementType: O O N N C C C C C C C C C H H H H H H H H H H H H H H H H H H H H
charge: 0
multiplicity: 1
keywords: wb97x-d3
keywords: def2-TZVPP
keywords: def2/J RIJCOSX
keywords: DEFGRID2
keywords: scfconv7
keywords: smallprint printgap noloewdin
keywords: NOSOSCF
formula: C9H20N2O2
InChI: InChI=1/C9H20N2O2/c1-4-8-13-9(12)10-6-5-7-11(2)3/h10H,4-8H2,1-3H3
33 atoms
O  -1.975599 -0.440845 -0.615678
O  -1.470727 0.987318 1.061182
N  3.645795 -1.053818 0.427448
N  -0.127284 0.757792 -0.756532
C  2.000325 0.824705 0.538754
C  2.756167 -0.181053 -0.31671
C  0.955147 1.584844 -0.271412
C  4.711777 -0.329325 1.084428
C  4.194008 -2.067861 -0.446699
C  -3.251712 -0.737913 -0.044306
C  -4.32117 0.232217 -0.508377
C  -1.209523 0.476969 -0.01133
C  -5.683556 -0.147607 0.051726
H  1.516569 0.317571 1.378358
H  2.684786 1.562115 0.964916
H  3.298092 0.366537 -1.109981
H  2.03249 -0.822147 -0.828982
H  0.538158 2.395415 0.325005
H  1.424963 2.051912 -1.13883
H  0.011199 0.235176 -1.607247
H  5.362689 -1.028287 1.612203
H  4.318593 0.362587 1.8293
H  5.340866 0.249339 0.38834
H  3.390789 -2.647536 -0.905415
H  4.816543 -2.761289 0.121285
H  4.813033 -1.657076 -1.260657
H  -3.1913 -0.765363 1.045863
H  -3.483538 -1.748174 -0.384416
H  -4.065044 1.247563 -0.19534
H  -4.356086 0.234522 -1.601011
H  -6.458553 0.524002 -0.318012
H  -5.966847 -1.162471 -0.23421
H  -5.697207 -0.095341 1.141786
elementType: O N C H
totalener: -615.06260974 hartree
nucrepener: 833.50043696 hartree
electener: -1448.56304670 hartree
oneelecener: -2488.76425119 hartree
twoeener: 1040.20120449 hartree
cpcmener: -0.02229669 hartree
kineticenergy: 612.20139101 hartree
xcener: -59.908177626988 hartree
chargesum: 0.0000000
charge: -0.337076 -0.542126 -0.230838 -0.241558 -0.072021 -0.106881 -0.065473 -0.195647 -0.191216 0.033862 -0.088922 0.510436 -0.274012 0.064523 0.076816 0.063376 0.084095 0.101349 0.106416 0.175229 0.099511 0.100705 0.075856 0.096913 0.098749 0.074585 0.087266 0.108518 0.066934 0.062269 0.092509 0.080508 0.085346
qa: -0.3371 -0.5421 -0.2308 -0.2416 -0.0720 -0.1069 -0.0655 -0.1956 -0.1912 0.0339 -0.0889 0.5104 -0.2740 0.0645 0.0768 0.0634 0.0841 0.1013 0.1064 0.1752 0.0995 0.1007 0.0759 0.0969 0.0987 0.0746 0.0873 0.1085 0.0669 0.0623 0.0925 0.0805 0.0853
va: 2.0753 1.9600 2.9121 3.1756 3.7624 3.9267 3.9136 3.9298 3.9338 3.8496 3.8665 4.3163 3.9491 1.0332 1.0171 1.0095 1.0105 1.0200 1.0001 1.0148 0.9953 0.9935 1.0028 0.9960 0.9953 1.0031 1.0179 0.9985 1.0208 1.0122 1.0024 1.0017 1.0010
dispcorr: -0.011245359 hartree
energy: -615.073855101322
dipole: 5.67293 -5.08638 0.58655 -2.66928 2.39248 -0.27680 -0.98877 -0.46358 -1.45235
magnitude: 1.59059 au
magnitude: 4.04295 debye
