program: Orca
programVersion: 5.0.2
elementType: O O N N C C C C C C C C C H H H H H H H H H H H H H H H H H H H H
charge: 0
multiplicity: 1
keywords: wb97x-d3
keywords: def2-TZVPP
keywords: def2/J RIJCOSX
keywords: DEFGRID2
keywords: scfconv7
keywords: smallprint printgap noloewdin
keywords: NOSOSCF
formula: C9H20N2O2
InChI: InChI=1/C9H20N2O2/c1-4-8-13-9(12)10-6-5-7-11(2)3/h10H,4-8H2,1-3H3
33 atoms
O  -1.265604 -0.409706 0.671002
O  -0.711403 0.708962 -1.205796
N  1.904433 -0.797512 -0.276173
N  0.073286 1.33936 0.83807
C  2.517655 1.552054 0.367727
C  2.695741 0.37889 -0.589113
C  1.137714 2.200433 0.369832
C  1.907914 -1.731445 -1.376835
C  2.305711 -1.441665 0.951906
C  -2.127107 -1.284218 -0.061253
C  -3.485317 -0.678704 -0.361057
C  -0.620934 0.548556 -0.00377
C  -4.229226 -0.194346 0.875067
H  2.792309 1.271481 1.388595
H  3.237381 2.321541 0.074517
H  3.771923 0.131872 -0.640947
H  2.416199 0.711216 -1.59362
H  1.162961 3.08265 1.012184
H  0.883405 2.555417 -0.628595
H  0.147933 1.024892 1.794235
H  2.909592 -2.122725 -1.623331
H  1.508995 -1.258737 -2.276675
H  1.271815 -2.588538 -1.14598
H  2.209455 -0.768033 1.804295
H  3.346713 -1.807485 0.93638
H  1.659372 -2.298913 1.149805
H  -2.243883 -2.153719 0.587581
H  -1.637861 -1.622001 -0.977816
H  -3.390389 0.132422 -1.086294
H  -4.068312 -1.460882 -0.856443
H  -3.712565 0.630268 1.368596
H  -5.225581 0.163086 0.611388
H  -4.352273 -0.994959 1.608029
elementType: O N C H
totalener: -615.05908497 hartree
nucrepener: 909.24570859 hartree
electener: -1524.30479355 hartree
oneelecener: -2640.99678106 hartree
twoeener: 1116.69198750 hartree
cpcmener: -0.02092450 hartree
kineticenergy: 612.19802677 hartree
xcener: -59.911261587707 hartree
chargesum: 0.0000000
charge: -0.338027 -0.532850 -0.224047 -0.212686 -0.144570 -0.081489 -0.017868 -0.198432 -0.199324 0.022219 -0.107914 0.467048 -0.264245 0.075047 0.080396 0.076267 0.090006 0.103719 0.087597 0.159689 0.085573 0.096349 0.096392 0.095457 0.084436 0.099094 0.108997 0.100650 0.068040 0.073697 0.079878 0.091929 0.078971
qa: -0.3380 -0.5328 -0.2240 -0.2127 -0.1446 -0.0815 -0.0179 -0.1984 -0.1993 0.0222 -0.1079 0.4670 -0.2642 0.0750 0.0804 0.0763 0.0900 0.1037 0.0876 0.1597 0.0856 0.0963 0.0964 0.0955 0.0844 0.0991 0.1090 0.1006 0.0680 0.0737 0.0799 0.0919 0.0790
va: 2.0377 1.9680 2.8866 3.1646 3.8862 3.8638 3.8642 3.9118 3.9281 3.8570 3.8778 4.4204 3.9273 1.0079 1.0205 1.0159 1.0020 1.0022 1.0254 1.0239 1.0064 1.0019 0.9941 0.9953 1.0080 0.9967 0.9955 1.0131 1.0218 1.0116 1.0086 1.0044 1.0014
dispcorr: -0.014838200 hartree
energy: -615.073923165104
dipole: 2.50197 -1.78021 0.72176 -4.67886 4.32887 -0.34999 1.11792 0.07681 1.19473
magnitude: 1.43904 au
magnitude: 3.65774 debye
