program: Orca
programVersion: 5.0.2
elementType: O O N N C C C C C C C C C H H H H H H H H H H H H H H H H H H H H
charge: 0
multiplicity: 1
keywords: wb97x-d3
keywords: def2-TZVPP
keywords: def2/J RIJCOSX
keywords: DEFGRID2
keywords: scfconv7
keywords: smallprint printgap noloewdin
keywords: NOSOSCF
formula: C9H20N2O2
InChI: InChI=1/C9H20N2O2/c1-4-8-13-9(12)10-6-5-7-11(2)3/h10H,4-8H2,1-3H3
33 atoms
O  -1.672047 -0.001578 -0.941531
O  -1.543004 2.059159 -0.030223
N  2.271923 -1.028195 -0.074987
N  0.302484 0.966844 -0.803115
C  2.099069 1.29239 0.871086
C  2.985366 0.113869 0.484392
C  1.303609 1.876594 -0.291174
C  1.45743 -1.700452 0.917525
C  3.198081 -1.962641 -0.681125
C  -3.084124 -0.049526 -0.726545
C  -3.454895 -0.453005 0.687413
C  -1.00689 1.090251 -0.535939
C  -2.885541 -1.798858 1.109756
H  1.42063 1.03413 1.688527
H  2.756048 2.074528 1.260805
H  3.588591 -0.186433 1.358005
H  3.69575 0.460551 -0.272033
H  0.815905 2.800181 0.015971
H  1.986461 2.140623 -1.103389
H  0.658919 0.048916 -1.045922
H  0.709194 -1.027874 1.337159
H  2.049098 -2.103833 1.753959
H  0.923612 -2.532538 0.456267
H  2.65204 -2.79508 -1.127617
H  3.921478 -2.384087 0.033629
H  3.762679 -1.47339 -1.47641
H  -3.442722 -0.797865 -1.43502
H  -3.546706 0.902542 -0.994969
H  -3.152925 0.324103 1.39301
H  -4.54726 -0.488155 0.725368
H  -3.205706 -2.59615 0.435907
H  -1.794766 -1.795634 1.124999
H  -3.220596 -2.063872 2.113104
elementType: O N C H
totalener: -615.06206398 hartree
nucrepener: 888.15791265 hartree
electener: -1503.21997663 hartree
oneelecener: -2598.13583056 hartree
twoeener: 1094.91585393 hartree
cpcmener: -0.01838580 hartree
kineticenergy: 612.20994569 hartree
xcener: -59.912793718260 hartree
chargesum: -0.0000000
charge: -0.337759 -0.544035 -0.244265 -0.251193 -0.135285 -0.074992 -0.039430 -0.209039 -0.190319 0.019296 -0.107839 0.500736 -0.252150 0.079747 0.082992 0.081857 0.090522 0.094817 0.096356 0.179372 0.093164 0.093839 0.107639 0.099462 0.080482 0.098551 0.106505 0.100907 0.066646 0.072998 0.080913 0.067511 0.091995
qa: -0.3378 -0.5440 -0.2443 -0.2512 -0.1353 -0.0750 -0.0394 -0.2090 -0.1903 0.0193 -0.1078 0.5007 -0.2521 0.0797 0.0830 0.0819 0.0905 0.0948 0.0964 0.1794 0.0932 0.0938 0.1076 0.0995 0.0805 0.0986 0.1065 0.1009 0.0666 0.0730 0.0809 0.0675 0.0920
va: 2.0458 1.9655 2.8842 3.1261 3.8807 3.8805 3.8801 3.9146 3.9159 3.8632 3.8653 4.3289 3.9286 1.0086 1.0185 1.0141 1.0002 1.0312 1.0008 1.0632 0.9936 1.0081 0.9942 0.9964 1.0018 0.9981 0.9971 1.0167 1.0236 1.0139 1.0027 1.0080 1.0057
dispcorr: -0.013737676 hartree
energy: -615.075801661150
dipole: 5.81813 -4.65673 1.16140 -10.02260 8.68379 -1.33881 5.78739 -5.64314 0.14425
magnitude: 1.77822 au
magnitude: 4.51989 debye
