program: Orca
programVersion: 5.0.2
elementType: O O N N C C C C C C C C C H H H H H H H H H H H H H H H H H H H H
charge: 0
multiplicity: 1
keywords: wb97x-d3
keywords: def2-TZVPP
keywords: def2/J RIJCOSX
keywords: DEFGRID2
keywords: scfconv7
keywords: smallprint printgap noloewdin
keywords: NOSOSCF
formula: C9H20N2O2
InChI: InChI=1/C9H20N2O2/c1-4-8-13-9(12)10-6-5-7-11(2)3/h10H,4-8H2,1-3H3
33 atoms
O  -2.475136 0.872644 0.86609
O  -1.500418 0.816561 -1.17071
N  3.936374 -1.241796 -0.272102
N  -0.294609 1.166355 0.725101
C  1.762115 -0.128818 0.229856
C  3.150268 -0.025244 -0.384992
C  1.014453 1.195109 0.114837
C  4.352816 -1.493787 1.091282
C  5.089639 -1.185311 -1.144343
C  -3.775224 0.697748 0.29719
C  -4.093534 -0.748496 -0.028779
C  -1.424922 0.934011 0.037756
C  -5.524849 -0.880503 -0.528942
H  1.195052 -0.917384 -0.272727
H  1.822643 -0.401925 1.28704
H  3.68357 0.835769 0.056912
H  3.036942 0.203208 -1.448413
H  1.591672 1.987963 0.59664
H  0.905951 1.484084 -0.93104
H  -0.343638 1.190072 1.732182
H  4.952296 -0.674281 1.520725
H  4.957376 -2.401049 1.134507
H  3.495028 -1.652611 1.744708
H  4.774432 -1.068151 -2.182831
H  5.657415 -2.115028 -1.077042
H  5.78018 -0.35919 -0.909929
H  -3.895755 1.332384 -0.584087
H  -4.460094 1.068042 1.061529
H  -3.404255 -1.125172 -0.787092
H  -3.953323 -1.362523 0.864645
H  -5.758421 -1.915378 -0.779565
H  -6.245278 -0.554354 0.223707
H  -5.691245 -0.281471 -1.426386
elementType: O N C H
totalener: -615.06231722 hartree
nucrepener: 820.14878612 hartree
electener: -1435.21110334 hartree
oneelecener: -2462.11447416 hartree
twoeener: 1026.90337082 hartree
cpcmener: -0.02210077 hartree
kineticenergy: 612.19219257 hartree
xcener: -59.906301497013 hartree
chargesum: -0.0000000
charge: -0.338845 -0.544272 -0.235907 -0.237164 -0.063693 -0.113435 -0.044897 -0.193493 -0.189213 0.032365 -0.094502 0.512902 -0.272361 0.064437 0.066929 0.067536 0.091195 0.101609 0.089675 0.170847 0.075552 0.099263 0.100084 0.097562 0.098016 0.074200 0.089533 0.107617 0.067549 0.062452 0.092890 0.081353 0.084215
qa: -0.3388 -0.5443 -0.2359 -0.2372 -0.0637 -0.1134 -0.0449 -0.1935 -0.1892 0.0324 -0.0945 0.5129 -0.2724 0.0644 0.0669 0.0675 0.0912 0.1016 0.0897 0.1708 0.0756 0.0993 0.1001 0.0976 0.0980 0.0742 0.0895 0.1076 0.0675 0.0625 0.0929 0.0814 0.0842
va: 2.0722 1.9582 2.9053 3.1921 3.7922 3.9500 3.8814 3.9321 3.9311 3.8536 3.8600 4.3048 3.9463 1.0308 1.0238 1.0096 1.0004 1.0021 1.0237 1.0189 1.0051 0.9950 0.9929 0.9965 0.9950 1.0010 1.0146 0.9995 1.0248 1.0121 1.0026 1.0019 1.0010
dispcorr: -0.010813430 hartree
energy: -615.073130651102
dipole: 7.34268 -6.86892 0.47376 -6.24126 6.51801 0.27675 0.08243 1.34553 1.42796
magnitude: 1.52974 au
magnitude: 3.88829 debye
