program: Orca
programVersion: 5.0.2
elementType: O O N N C C C C C C C C C H H H H H H H H H H H H H H H H H H H H
charge: 0
multiplicity: 1
keywords: wb97x-d3
keywords: def2-TZVPP
keywords: def2/J RIJCOSX
keywords: DEFGRID2
keywords: scfconv7
keywords: smallprint printgap noloewdin
keywords: NOSOSCF
formula: C9H20N2O2
InChI: InChI=1/C9H20N2O2/c1-4-8-13-9(12)10-6-5-7-11(2)3/h10H,4-8H2,1-3H3
33 atoms
O  -2.459958 0.900678 -0.933851
O  -1.389198 0.904129 1.054999
N  3.787558 -1.248889 0.483001
N  -0.280707 1.252799 -0.897857
C  1.707687 -0.080854 -0.235944
C  3.102231 0.026612 0.364668
C  1.05013 1.290826 -0.335116
C  4.183474 -1.776702 -0.804757
C  4.939446 -1.132647 1.349883
C  -3.721814 0.658956 -0.307165
C  -3.952031 -0.804137 0.018446
C  -1.374193 1.003335 -0.157793
C  -5.354943 -1.014962 0.569609
H  1.742721 -0.523254 -1.235146
H  1.09502 -0.739304 0.385955
H  3.010082 0.450352 1.368747
H  3.700681 0.749837 -0.218466
H  1.004992 1.765407 0.64582
H  1.651176 1.946266 -0.967225
H  -0.368044 1.225348 -1.901867
H  4.693094 -2.732741 -0.674618
H  4.865747 -1.109086 -1.355943
H  3.317953 -1.961892 -1.440642
H  4.635286 -0.79752 2.342814
H  5.701842 -0.428573 0.979696
H  5.421754 -2.104786 1.465792
H  -4.458178 1.000167 -1.03655
H  -3.831843 1.280184 0.585242
H  -3.814643 -1.404103 -0.885159
H  -3.21565 -1.149951 0.746902
H  -5.521472 -0.429057 1.475478
H  -6.118254 -0.72608 -0.155395
H  -5.522652 -2.061886 0.822565
elementType: O N C H
totalener: -615.06269038 hartree
nucrepener: 824.00917623 hartree
electener: -1439.07186661 hartree
oneelecener: -2469.89460205 hartree
twoeener: 1030.82273543 hartree
cpcmener: -0.02223201 hartree
kineticenergy: 612.19512375 hartree
xcener: -59.906790158469 hartree
chargesum: 0.0000000
charge: -0.337419 -0.544210 -0.236258 -0.242864 -0.067652 -0.109633 -0.043531 -0.190823 -0.190303 0.034180 -0.093547 0.514443 -0.272916 0.066873 0.063269 0.090059 0.067987 0.091379 0.101308 0.172168 0.098819 0.074603 0.099585 0.097216 0.074003 0.098363 0.106775 0.089606 0.062222 0.067388 0.084080 0.081815 0.093015
qa: -0.3374 -0.5442 -0.2363 -0.2429 -0.0677 -0.1096 -0.0435 -0.1908 -0.1903 0.0342 -0.0935 0.5144 -0.2729 0.0669 0.0633 0.0901 0.0680 0.0914 0.1013 0.1722 0.0988 0.0746 0.0996 0.0972 0.0740 0.0984 0.1068 0.0896 0.0622 0.0674 0.0841 0.0818 0.0930
va: 2.0745 1.9568 2.9050 3.1907 3.7668 3.9466 3.8888 3.9306 3.9332 3.8523 3.8605 4.3050 3.9464 1.0241 1.0361 1.0007 1.0093 1.0182 1.0040 1.0185 0.9950 1.0050 0.9932 0.9966 1.0010 0.9949 0.9994 1.0148 1.0121 1.0240 1.0011 1.0018 1.0026
dispcorr: -0.010938263 hartree
energy: -615.073628640664
dipole: 7.20261 -6.77458 0.42802 -7.15911 7.30702 0.14792 0.62622 -2.11087 -1.48465
magnitude: 1.55218 au
magnitude: 3.94533 debye
