program: Orca
programVersion: 5.0.2
elementType: O O N N C C C C C C C C C H H H H H H H H H H H H H H H H H H H H
charge: 0
multiplicity: 1
keywords: wb97x-d3
keywords: def2-TZVPP
keywords: def2/J RIJCOSX
keywords: DEFGRID2
keywords: scfconv7
keywords: smallprint printgap noloewdin
keywords: NOSOSCF
formula: C9H20N2O2
InChI: InChI=1/C9H20N2O2/c1-4-8-13-9(12)10-6-5-7-11(2)3/h10H,4-8H2,1-3H3
33 atoms
O  -1.158389 -0.098908 0.967274
O  -0.738396 0.829878 -1.044828
N  1.813312 -0.840924 -0.266489
N  0.320065 1.538739 0.844314
C  2.694044 1.48771 0.062906
C  2.636005 0.232123 -0.799194
C  1.387184 2.262984 0.187982
C  1.5635 -1.848686 -1.270094
C  2.359492 -1.425291 0.935505
C  -2.164873 -0.944124 0.40667
C  -3.494887 -0.239615 0.217594
C  -0.52369 0.749865 0.149434
C  -4.546735 -1.205815 -0.307368
H  3.083921 1.261737 1.059436
H  3.427502 2.160993 -0.389807
H  3.668915 -0.115005 -0.981735
H  2.234273 0.50644 -1.77908
H  1.570543 3.17727 0.755576
H  1.037718 2.577728 -0.795117
H  0.488685 1.278278 1.804678
H  1.052996 -1.409508 -2.128892
H  0.916282 -2.629497 -0.866822
H  2.477996 -2.33971 -1.641765
H  1.700951 -2.218099 1.293958
H  2.43391 -0.688037 1.735356
H  3.360978 -1.86374 0.79458
H  -2.271961 -1.758097 1.124995
H  -1.817589 -1.381919 -0.532448
H  -3.821153 0.182783 1.171505
H  -3.385034 0.593949 -0.478623
H  -4.253913 -1.631774 -1.268785
H  -4.713684 -2.03394 0.383751
H  -5.502418 -0.701823 -0.451704
elementType: O N C H
totalener: -615.05936689 hartree
nucrepener: 904.14446907 hartree
electener: -1519.20383596 hartree
oneelecener: -2630.76281629 hartree
twoeener: 1111.55898033 hartree
cpcmener: -0.02057824 hartree
kineticenergy: 612.20543611 hartree
xcener: -59.912751719177 hartree
chargesum: 0.0000000
charge: -0.335485 -0.533670 -0.223032 -0.208196 -0.147112 -0.082678 -0.019001 -0.199301 -0.199090 0.035797 -0.095261 0.463726 -0.274893 0.076243 0.081153 0.077084 0.090612 0.102805 0.088190 0.158075 0.094994 0.097064 0.087117 0.098793 0.095549 0.084497 0.107686 0.086718 0.063278 0.068951 0.084251 0.082325 0.092811
qa: -0.3355 -0.5337 -0.2230 -0.2082 -0.1471 -0.0827 -0.0190 -0.1993 -0.1991 0.0358 -0.0953 0.4637 -0.2749 0.0762 0.0812 0.0771 0.0906 0.1028 0.0882 0.1581 0.0950 0.0971 0.0871 0.0988 0.0955 0.0845 0.1077 0.0867 0.0633 0.0690 0.0843 0.0823 0.0928
va: 2.0600 1.9647 2.8824 3.1695 3.8847 3.8585 3.8659 3.9076 3.9299 3.8497 3.8745 4.4255 3.9475 1.0080 1.0206 1.0164 1.0030 1.0029 1.0248 1.0248 1.0033 0.9939 1.0063 0.9970 0.9945 1.0074 0.9997 1.0092 1.0120 1.0240 1.0011 1.0014 1.0027
dispcorr: -0.014559833 hartree
energy: -615.073926722024
dipole: 1.55247 -0.73004 0.82243 -6.90223 6.57453 -0.32770 -1.18010 2.30243 1.12234
magnitude: 1.42948 au
magnitude: 3.63346 debye
