program: Orca
programVersion: 5.0.2
elementType: O O N N C C C C C C C C C H H H H H H H H H H H H H H H H H H H H
charge: 0
multiplicity: 1
keywords: wb97x-d3
keywords: def2-TZVPP
keywords: def2/J RIJCOSX
keywords: DEFGRID2
keywords: scfconv7
keywords: smallprint printgap noloewdin
keywords: NOSOSCF
formula: C9H20N2O2
InChI: InChI=1/C9H20N2O2/c1-4-8-13-9(12)10-6-5-7-11(2)3/h10H,4-8H2,1-3H3
33 atoms
O  -2.091432 0.311377 0.475903
O  -1.185547 1.240926 -1.36676
N  3.682579 -1.258184 0.344363
N  -0.043177 1.135065 0.594776
C  2.186221 0.65584 -0.418255
C  2.683288 -0.267578 0.69631
C  1.19564 1.693437 0.098027
C  3.199245 -2.27045 -0.565567
C  4.930043 -0.686452 -0.106039
C  -3.317863 0.077709 -0.221478
C  -4.246657 -0.677749 0.704545
C  -1.106832 0.918544 -0.196465
C  -5.592285 -0.924532 0.039479
H  3.027539 1.196569 -0.860779
H  1.721446 0.082112 -1.22506
H  1.832195 -0.801709 1.129898
H  3.096718 0.351889 1.500143
H  1.648503 2.262882 0.911951
H  0.963443 2.411862 -0.687279
H  -0.064472 0.773931 1.535701
H  3.928138 -3.080542 -0.639699
H  3.009557 -1.912975 -1.58859
H  2.270251 -2.702443 -0.188891
H  5.2738 0.071376 0.600814
H  4.885601 -0.217375 -1.100237
H  5.699063 -1.460899 -0.151968
H  -3.132959 -0.501651 -1.129606
H  -3.765959 1.03054 -0.517165
H  -3.790914 -1.63128 0.983215
H  -4.390374 -0.109661 1.627192
H  -6.257117 -1.481228 0.699617
H  -6.091452 0.012054 -0.213984
H  -5.485865 -1.502345 -0.880176
elementType: O N C H
totalener: -615.06150259 hartree
nucrepener: 832.08479841 hartree
electener: -1447.14630099 hartree
oneelecener: -2485.76849335 hartree
twoeener: 1038.62219235 hartree
cpcmener: -0.02222297 hartree
kineticenergy: 612.20068282 hartree
xcener: -59.910845894081 hartree
chargesum: 0.0000000
charge: -0.329273 -0.542862 -0.249727 -0.238263 -0.103661 -0.081725 -0.070832 -0.201924 -0.203241 0.037034 -0.084928 0.515198 -0.275422 0.078386 0.073662 0.084962 0.088804 0.106433 0.100417 0.176075 0.099789 0.078411 0.098875 0.099333 0.077356 0.100559 0.089551 0.092216 0.064067 0.062699 0.092835 0.082986 0.082208
qa: -0.3293 -0.5429 -0.2497 -0.2383 -0.1037 -0.0817 -0.0708 -0.2019 -0.2032 0.0370 -0.0849 0.5152 -0.2754 0.0784 0.0737 0.0850 0.0888 0.1064 0.1004 0.1761 0.0998 0.0784 0.0989 0.0993 0.0774 0.1006 0.0896 0.0922 0.0641 0.0627 0.0928 0.0830 0.0822
va: 2.0701 1.9623 2.9066 3.1726 3.7835 3.9096 3.9224 3.9452 3.9464 3.8504 3.9220 4.3038 3.9521 1.0146 1.0178 1.0131 1.0009 1.0009 1.0186 1.0142 0.9938 0.9926 0.9944 0.9932 0.9918 0.9944 1.0009 0.9982 1.0102 1.0103 1.0038 1.0014 1.0013
dispcorr: -0.011334477 hartree
energy: -615.072837065840
dipole: 3.86540 -3.72819 0.13721 -6.54648 6.33878 -0.20771 -0.09819 1.11823 1.02004
magnitude: 1.04997 au
magnitude: 2.66882 debye
