program: Orca
programVersion: 5.0.2
elementType: O O N N C C C C C C C C C H H H H H H H H H H H H H H H H H H H H
charge: 0
multiplicity: 1
keywords: wb97x-d3
keywords: def2-TZVPP
keywords: def2/J RIJCOSX
keywords: DEFGRID2
keywords: scfconv7
keywords: smallprint printgap noloewdin
keywords: NOSOSCF
formula: C9H20N2O2
InChI: InChI=1/C9H20N2O2/c1-4-8-13-9(12)10-6-5-7-11(2)3/h10H,4-8H2,1-3H3
33 atoms
O  -2.068358 0.356453 0.505376
O  -1.115204 1.22343 -1.343741
N  3.615058 -1.285835 0.30486
N  -0.032314 1.205249 0.653227
C  2.178954 0.698535 -0.386379
C  2.677583 -0.252981 0.702674
C  1.217561 1.746013 0.163555
C  3.047103 -2.271484 -0.585003
C  4.865886 -0.768655 -0.198135
C  -3.263649 0.060581 -0.222258
C  -4.191103 -0.703929 0.697496
C  -1.069765 0.946612 -0.159789
C  -5.500142 -1.036831 -0.002097
H  3.022691 1.22903 -0.836493
H  1.689044 0.147356 -1.193952
H  1.821076 -0.75028 1.168481
H  3.150583 0.342286 1.491819
H  1.686018 2.279954 0.992276
H  1.001519 2.493357 -0.599589
H  -0.074538 0.874886 1.604396
H  2.828209 -1.902191 -1.597982
H  2.11715 -2.663217 -0.168375
H  3.734788 -3.113228 -0.693205
H  5.280797 -0.04025 0.501405
H  4.797266 -0.281788 -1.182334
H  5.592024 -1.579063 -0.292434
H  -3.030525 -0.535575 -1.108582
H  -3.735825 0.988911 -0.5571
H  -3.702542 -1.625394 1.024606
H  -4.392862 -0.113069 1.59471
H  -5.336016 -1.645326 -0.893225
H  -6.162907 -1.596193 0.658325
H  -6.031246 -0.134772 -0.310648
elementType: O N C H
totalener: -615.06165661 hartree
nucrepener: 834.69685998 hartree
electener: -1449.75851659 hartree
oneelecener: -2491.02230653 hartree
twoeener: 1041.26378994 hartree
cpcmener: -0.02225024 hartree
kineticenergy: 612.20103596 hartree
xcener: -59.910923361022 hartree
chargesum: 0.0000000
charge: -0.328413 -0.543235 -0.249739 -0.240833 -0.107516 -0.081067 -0.067407 -0.200868 -0.203255 0.036709 -0.084524 0.515931 -0.275201 0.079148 0.073811 0.084799 0.087888 0.105007 0.102013 0.176434 0.077992 0.098295 0.099695 0.099151 0.077954 0.100591 0.088983 0.093359 0.063505 0.063030 0.082083 0.092814 0.082867
qa: -0.3284 -0.5432 -0.2497 -0.2408 -0.1075 -0.0811 -0.0674 -0.2009 -0.2033 0.0367 -0.0845 0.5159 -0.2752 0.0791 0.0738 0.0848 0.0879 0.1050 0.1020 0.1764 0.0780 0.0983 0.0997 0.0992 0.0780 0.1006 0.0890 0.0934 0.0635 0.0630 0.0821 0.0928 0.0829
va: 2.0711 1.9614 2.9062 3.1715 3.7730 3.9075 3.9219 3.9455 3.9456 3.8498 3.9223 4.3034 3.9525 1.0143 1.0202 1.0135 1.0014 1.0016 1.0160 1.0140 0.9927 0.9946 0.9940 0.9933 0.9915 0.9943 1.0014 0.9978 1.0103 1.0101 1.0013 1.0036 1.0015
dispcorr: -0.011417048 hartree
energy: -615.073073656173
dipole: 3.65597 -3.55786 0.09811 -6.87649 6.69911 -0.17738 -0.35313 1.39300 1.03987
magnitude: 1.05944 au
magnitude: 2.69289 debye
