program: Orca
programVersion: 5.0.2
elementType: O O N N C C C C C C C C C H H H H H H H H H H H H H H H H H H H H
charge: 0
multiplicity: 1
keywords: wb97x-d3
keywords: def2-TZVPP
keywords: def2/J RIJCOSX
keywords: DEFGRID2
keywords: scfconv7
keywords: smallprint printgap noloewdin
keywords: NOSOSCF
formula: C9H20N2O2
InChI: InChI=1/C9H20N2O2/c1-4-8-13-9(12)10-6-5-7-11(2)3/h10H,4-8H2,1-3H3
33 atoms
O  -2.243297 0.541519 -0.935342
O  -1.578107 1.754957 0.849239
N  3.59171 -1.076207 0.309621
N  -0.124545 1.140181 -0.785908
C  1.943466 0.781881 0.561042
C  2.562416 -0.280607 -0.337018
C  1.057728 1.748347 -0.216679
C  4.282463 -1.891966 -0.665123
C  3.064669 -1.904329 1.372733
C  -3.597679 0.527399 -0.474816
C  -3.856717 -0.503052 0.607226
C  -1.331074 1.187525 -0.197938
C  -3.485591 -1.921885 0.205448
H  1.356636 0.335641 1.367789
H  2.743749 1.360411 1.030768
H  3.029395 0.227031 -1.187009
H  1.768734 -0.922019 -0.759523
H  0.749082 2.568427 0.429799
H  1.6290 2.19522 -1.033162
H  -0.032303 0.626877 -1.648419
H  4.723605 -1.263196 -1.440795
H  3.631411 -2.62791 -1.164069
H  5.095131 -2.443203 -0.188434
H  2.300775 -2.621359 1.030303
H  2.619579 -1.298434 2.162018
H  3.872704 -2.478903 1.829039
H  -4.181577 0.287651 -1.364737
H  -3.898501 1.524124 -0.145012
H  -3.342255 -0.224362 1.528995
H  -4.926237 -0.452673 0.830405
H  -3.740664 -2.626858 0.997554
H  -4.018167 -2.234688 -0.695124
H  -2.417049 -2.0270 0.013049
elementType: O N C H
totalener: -615.06165686 hartree
nucrepener: 846.82912838 hartree
electener: -1461.89078523 hartree
oneelecener: -2515.34407669 hartree
twoeener: 1053.45329146 hartree
cpcmener: -0.02164887 hartree
kineticenergy: 612.19843750 hartree
xcener: -59.907926481961 hartree
chargesum: -0.0000000
charge: -0.340973 -0.542841 -0.233990 -0.232932 -0.066748 -0.101808 -0.077926 -0.189850 -0.195066 0.018699 -0.111492 0.517999 -0.261572 0.069168 0.066541 0.085865 0.065783 0.098189 0.107058 0.176187 0.096877 0.074200 0.098379 0.074643 0.101382 0.099262 0.108092 0.102979 0.068696 0.074265 0.091585 0.079384 0.079965
qa: -0.3410 -0.5428 -0.2340 -0.2329 -0.0667 -0.1018 -0.0779 -0.1898 -0.1951 0.0187 -0.1115 0.5180 -0.2616 0.0692 0.0665 0.0859 0.0658 0.0982 0.1071 0.1762 0.0969 0.0742 0.0984 0.0746 0.1014 0.0993 0.1081 0.1030 0.0687 0.0743 0.0916 0.0794 0.0800
va: 2.0523 1.9617 2.9114 3.1708 3.7878 3.9187 3.9163 3.9316 3.9327 3.8648 3.8631 4.3055 3.9256 1.0226 1.0296 0.9998 1.0172 1.0244 1.0002 1.0148 0.9965 1.0026 0.9953 1.0043 0.9932 0.9944 0.9969 1.0149 1.0229 1.0127 1.0045 1.0012 1.0092
dispcorr: -0.011662450 hartree
energy: -615.073319306510
dipole: 6.28261 -6.09462 0.18799 -11.14738 10.29537 -0.85201 1.10898 -2.32958 -1.22060
magnitude: 1.50037 au
magnitude: 3.81365 debye
