program: Orca
programVersion: 5.0.2
elementType: O O N N C C C C C C C C C H H H H H H H H H H H H H H H H H H H H
charge: 0
multiplicity: 1
keywords: wb97x-d3
keywords: def2-TZVPP
keywords: def2/J RIJCOSX
keywords: DEFGRID2
keywords: scfconv7
keywords: smallprint printgap noloewdin
keywords: NOSOSCF
formula: C9H20N2O2
InChI: InChI=1/C9H20N2O2/c1-4-8-13-9(12)10-6-5-7-11(2)3/h10H,4-8H2,1-3H3
33 atoms
O  -2.434074 0.429171 0.047497
O  -0.840002 -1.14897 0.254238
N  3.638674 -0.64953 -0.122191
N  -0.396549 0.865395 -0.696523
C  1.823019 0.981668 0.404568
C  3.313152 0.715497 0.252654
C  1.025711 0.6480 -0.850703
C  3.213581 -1.611206 0.871294
C  5.054523 -0.776716 -0.382494
C  -3.407231 -0.451813 0.617374
C  -4.735877 0.269658 0.650974
C  -1.190484 -0.037671 -0.099211
C  -5.275016 0.643888 -0.721093
H  1.416237 0.432865 1.257547
H  1.697061 2.041876 0.641048
H  3.81816 1.006269 1.190991
H  3.710759 1.376659 -0.523667
H  1.364444 1.268693 -1.68202
H  1.193475 -0.385321 -1.151467
H  -0.759629 1.79109 -0.861631
H  3.506713 -2.615359 0.561321
H  2.128444 -1.617462 0.978918
H  3.648758 -1.431506 1.8680
H  5.357813 -0.086699 -1.171996
H  5.287271 -1.787265 -0.723442
H  5.684015 -0.570624 0.498254
H  -3.105139 -0.738547 1.627842
H  -3.484146 -1.363355 0.017773
H  -5.440313 -0.399603 1.151285
H  -4.657862 1.157244 1.284609
H  -5.365918 -0.233946 -1.363804
H  -6.26584 1.091726 -0.637788
H  -4.636052 1.364704 -1.231785
elementType: O N C H
totalener: -615.06333524 hartree
nucrepener: 840.38245694 hartree
electener: -1455.44579218 hartree
oneelecener: -2502.88926794 hartree
twoeener: 1047.44347576 hartree
cpcmener: -0.02118547 hartree
kineticenergy: 612.20300416 hartree
xcener: -59.909212325064 hartree
chargesum: 0.0000000
charge: -0.330931 -0.543707 -0.244519 -0.244433 -0.126500 -0.096182 -0.033122 -0.186664 -0.192350 0.020682 -0.100622 0.521556 -0.254006 0.079811 0.083927 0.082815 0.089493 0.103492 0.088007 0.173292 0.097970 0.088962 0.079323 0.097324 0.098654 0.071003 0.105010 0.094866 0.065469 0.062920 0.078157 0.090477 0.079824
qa: -0.3309 -0.5437 -0.2445 -0.2444 -0.1265 -0.0962 -0.0331 -0.1867 -0.1924 0.0207 -0.1006 0.5216 -0.2540 0.0798 0.0839 0.0828 0.0895 0.1035 0.0880 0.1733 0.0980 0.0890 0.0793 0.0973 0.0987 0.0710 0.1050 0.0949 0.0655 0.0629 0.0782 0.0905 0.0798
va: 2.0667 1.9580 2.8629 3.1883 3.8270 3.9083 3.8303 3.9264 3.9351 3.8513 3.9476 4.2873 3.9152 1.0151 1.0194 1.0099 0.9991 1.0056 1.0376 1.0168 0.9976 1.0061 1.0050 0.9965 0.9961 1.0016 1.0030 0.9998 1.0113 1.0136 1.0029 1.0046 1.0103
dispcorr: -0.011713434 hartree
energy: -615.075048674364
dipole: 5.14959 -5.24575 -0.09616 0.63378 0.80626 1.44004 1.22027 -1.22279 -0.00251
magnitude: 1.44325 au
magnitude: 3.66845 debye
