program: Gaussian 09
title: 000065890
version: EM64L-G09RevD.01
frameworkgroup: C1[X(C10H13NO4S2)]
method: RPBEPBE
basis: SDD
operation: Freq
keyword: #p
keyword: freq=noraman
keyword: PBEPBE/SDD
title: #p freq=noraman PBEPBE/SDD
converged: YES YES NO NO
title: Mulliken charges:
elementType: S S O O O O N C C C C C C C C C C H H H H H H H H H H H H H
charge: 0.275190 0.288469 -0.415692 -0.227444 -0.416304 -0.212440 0.017990 -0.343780 -0.648457 -0.471814 -0.243967 0.348024 -0.511193 -0.617918 -0.760704 0.180793 0.211772 0.235880 0.236287 0.280629 0.277540 0.254553 0.253329 0.273013 0.265880 0.258428 0.239607 0.212858 0.378898 0.380570
chargesum: 0.00000
title: Mulliken charges with hydrogens summed into heavy atoms:
elementType: S S O O O O N C C C C C C C C C C
charge: 0.275190 0.288469 -0.036794 -0.227444 -0.035734 -0.212440 0.017990 0.128388 -0.090287 0.036068 -0.243967 0.348024 -0.511193 -0.079024 -0.049811 0.180793 0.211772
polarizability: 2.48844537e+02 1.29915096e+00 1.53155041e+02 5.97882036e+00 -3.51795576e+00 9.60361766e+01
1716.lowfreq: -5.7900 -4.0103 -1.8034 -0.0019 -0.0010 0.0013 11.1030 15.2505 19.0413
frequency: 11.0432 15.1031 19.0111 26.0120 40.0277 46.6753 51.2285 64.9767 76.4032 109.9421 112.5650 148.9464 177.7419 189.4879 243.1772 252.8057 304.1151 333.6986 350.9410 362.9973 452.9197 476.0657 483.9850 501.3274 521.0225 523.4945 575.1005 582.9628 618.6951 636.4125 638.9890 642.5422 694.6523 731.6840 742.7054 824.0606 837.1171 852.9062 869.5206 925.4177 960.5387 1017.6154 1024.0822 1033.3039 1042.4321 1048.7519 1068.1175 1083.2248 1129.5618 1169.0303 1208.3270 1229.4478 1243.0262 1249.2000 1257.4735 1289.8436 1297.2410 1319.4459 1340.7923 1374.2333 1398.4622 1435.2118 1439.3856 1441.0583 1448.5076 1458.0007 1467.6410 1479.2059 1577.9724 1670.7060 1677.6620 2991.0009 2992.6698 2993.3701 3011.5512 3038.6955 3039.8703 3070.6295 3071.7317 3076.6296 3100.3021 3116.7003 3513.5745 3514.0544
redmass: 8.6020 8.7248 6.6129 6.8378 4.8011 2.6443 1.7517 1.9417 2.9925 2.5255 5.8712 9.5835 6.6615 4.4322 5.9031 2.6665 5.1765 5.8687 7.4653 6.2727 4.7654 3.5573 2.7249 1.7875 7.9738 6.7543 4.8591 5.0734 4.8088 1.3317 7.6120 1.4126 6.6589 5.7169 1.1358 3.9206 1.4035 4.3051 4.5141 7.2728 2.1168 3.4365 2.3285 1.4321 1.5094 2.7940 2.6524 2.7345 1.2241 2.7263 1.2222 1.2894 1.2571 1.7218 1.4279 1.0743 4.3950 1.6320 2.0649 1.8013 1.2998 1.3048 1.3537 2.0643 1.1531 1.0558 1.0853 1.0893 6.9514 8.3423 8.5853 1.0393 1.0632 1.0609 1.0602 1.0573 1.0986 1.0935 1.1037 1.0972 1.0999 1.1085 1.0640 1.0641
irintensity: 0.3654 1.5225 0.6618 0.9080 0.2262 1.5416 0.5699 0.0398 0.0653 0.3141 0.3215 1.2519 1.4960 4.6072 1.1398 0.2845 13.4651 1.9785 0.1831 1.1672 12.9377 44.2400 44.0992 30.9813 4.4710 7.3151 24.7627 17.7011 24.0173 129.9644 5.8780 131.7948 6.3053 13.5756 17.3310 1.7039 1.3668 0.0670 3.6700 144.7447 4.8868 241.9140 23.8007 2.1526 9.9915 335.9437 6.8092 81.1576 0.0821 0.3025 2.9283 3.6499 0.4566 4.6260 0.3858 0.1251 32.7592 127.5834 37.2229 21.8303 38.8395 28.3575 82.7543 32.5604 56.1287 14.9491 27.6063 13.4614 5.7621 211.7337 173.0213 27.8918 8.7983 8.8149 8.7349 10.8246 1.3919 1.5706 13.9841 14.4576 20.5122 17.9444 23.4120 25.8892
temp: 298.150 k
press: 1.00000 atm
elementType: 16 16 8 8 8 8 7 6 6 6 6 6 6 6 6 6 6 1 1 1 1 1 1 1 1 1 1 1 1 1
symmnumber: 1
zpe: 577071.1 jmol-1
zpe.correction: 0.219795 hartree
zpe.thermalcorrener: 0.239486 hartree
zpe.thermalcorrenthalpy: 0.240430 hartree
zpe.thermalcorrgfe: 0.164397 hartree
zpe.sumelectzpe: -1539.347799 hartree
zpe.sumelectthermal: -1539.328108 hartree
zpe.sumelectthermalent: -1539.327164 hartree
zpe.sumelectthermalfe: -1539.403197 hartree
dipole: -1.2483 2.4413 -1.2534
dipole: 3.0148
quadrupole: -89.2013 -118.6461 -115.3760
quadrupole: 8.7110 0.6161 -1.9387
quadrupole: 18.5398 -10.9049 -7.6349 8.7110 0.6161 -1.9387
hfenergy: -1539.5675942 hartree
pointgroup: C01 [X(C10H13N1O4S2)]
dipole: 0.4894237 1.0462061 0.2698679 debye
polarizability: 248.7921696|0.1531298|151.867906|6.7389129|-9.174347|97.3756785 unknown
InChI: InChI=1S/C10H13NO4S2/c1-6-7(5-9(14)15)17-10(11-6)16-4-2-3-8(12)13/h12,14H,2-5H2,1H3
charge 0 multiplicity 1
30 atoms
S  -1.084727 -1.582802 0.420969
S  2.036682 -1.677494 0.705382
O  -6.933916 1.241198 -0.497258
O  -6.528425 -1.024014 -0.181655
O  6.46833 -0.328172 -0.478298
O  4.645425 0.417189 -1.712411
N  0.665534 0.58581 0.357001
C  -3.675118 -0.592821 0.046303
C  -2.228509 -0.087162 0.146764
C  -4.642436 0.588339 -0.17441
C  2.91617 -0.085023 0.636472
C  2.023596 0.958797 0.441617
C  0.49135 -0.716734 0.470439
C  4.413879 -0.045318 0.730942
C  2.377712 2.414198 0.285937
C  -6.088985 0.141717 -0.275416
C  5.122071 0.044382 -0.623399
H  -3.961436 -1.135123 0.966042
H  -3.776076 -1.311902 -0.787128
H  -1.885247 0.412425 -0.773417
H  -2.072438 0.595504 0.997533
H  -4.394012 1.146978 -1.09766
H  -4.572838 1.325147 0.64964
H  4.824508 -0.913856 1.273204
H  4.734413 0.844253 1.309785
H  2.345027 2.705382 -0.779906
H  1.652651 3.042057 0.831172
H  3.391355 2.634753 0.660657
H  -7.875902 0.9240 -0.558359
H  6.933063 -0.234707 -1.354042
