program: Orca
programVersion: 5.0.2
elementType: O O N N C C C C C C C C C H H H H H H H H H H H H H H H H H H H H
charge: 0
multiplicity: 1
keywords: wb97x-d3
keywords: def2-TZVPP
keywords: def2/J RIJCOSX
keywords: DEFGRID2
keywords: scfconv7
keywords: smallprint printgap noloewdin
keywords: NOSOSCF
formula: C9H20N2O2
InChI: InChI=1/C9H20N2O2/c1-4-8-13-9(12)10-6-5-7-11(2)3/h10H,4-8H2,1-3H3
33 atoms
O  -1.259469 -0.058517 0.90535
O  -0.688241 0.854813 -1.07627
N  1.86462 -0.840151 -0.117892
N  0.249224 1.555876 0.876733
C  2.664504 1.514757 0.226124
C  2.652103 0.263678 -0.645147
C  1.350975 2.287683 0.290913
C  2.460967 -1.433215 1.058544
C  1.635599 -1.841754 -1.134135
C  -2.204705 -0.924919 0.27498
C  -3.543175 -0.256002 0.021916
C  -0.557604 0.777327 0.130235
C  -4.526015 -1.238838 -0.599278
H  3.004025 1.28243 1.239542
H  3.417496 2.194238 -0.18335
H  3.695974 -0.049676 -0.826941
H  2.244918 0.529678 -1.62503
H  1.50325 3.193233 0.881206
H  1.057263 2.617586 -0.705443
H  0.352798 1.298296 1.846983
H  1.825607 -2.238929 1.431775
H  2.557405 -0.70525 1.864999
H  3.462539 -1.857103 0.873169
H  2.561825 -2.305715 -1.513061
H  1.113101 -1.404915 -1.987223
H  1.008312 -2.643076 -0.738545
H  -2.327407 -1.755494 0.972076
H  -1.792639 -1.334455 -0.650703
H  -3.943977 0.125147 0.965054
H  -3.415749 0.602943 -0.640789
H  -4.701789 -2.097888 0.051288
H  -5.490367 -0.764631 -0.783896
H  -4.159817 -1.618133 -1.555605
elementType: O N C H
totalener: -615.05972055 hartree
nucrepener: 900.32733144 hartree
electener: -1515.38705199 hartree
oneelecener: -2623.13546488 hartree
twoeener: 1107.74841289 hartree
cpcmener: -0.02034973 hartree
kineticenergy: 612.18622938 hartree
xcener: -59.908136534856 hartree
chargesum: 0.0000000
charge: -0.335630 -0.534528 -0.225440 -0.207060 -0.144006 -0.081205 -0.020201 -0.199228 -0.199892 0.037517 -0.094327 0.464076 -0.274392 0.074991 0.079946 0.078535 0.089825 0.102438 0.089324 0.158328 0.099112 0.097577 0.081301 0.087120 0.093496 0.098608 0.108457 0.085221 0.062935 0.068074 0.082089 0.092821 0.084116
qa: -0.3356 -0.5345 -0.2254 -0.2071 -0.1440 -0.0812 -0.0202 -0.1992 -0.1999 0.0375 -0.0943 0.4641 -0.2744 0.0750 0.0799 0.0785 0.0898 0.1024 0.0893 0.1583 0.0991 0.0976 0.0813 0.0871 0.0935 0.0986 0.1085 0.0852 0.0629 0.0681 0.0821 0.0928 0.0841
va: 2.0608 1.9640 2.8806 3.1716 3.8825 3.8514 3.8661 3.9334 3.9055 3.8482 3.8763 4.4191 3.9478 1.0099 1.0206 1.0164 1.0050 1.0031 1.0237 1.0243 0.9966 0.9941 1.0077 1.0071 1.0045 0.9937 0.9993 1.0105 1.0121 1.0232 1.0014 1.0028 1.0009
dispcorr: -0.014320931 hartree
energy: -615.074041482673
dipole: 1.87091 -1.11471 0.75620 -7.04209 6.72483 -0.31726 -1.24422 2.39309 1.14887
magnitude: 1.41153 au
magnitude: 3.58781 debye
