program: Orca
programVersion: 5.0.2
elementType: O O N N C C C C C C C C C H H H H H H H H H H H H H H H H H H H H
charge: 0
multiplicity: 1
keywords: wb97x-d3
keywords: def2-TZVPP
keywords: def2/J RIJCOSX
keywords: DEFGRID2
keywords: scfconv7
keywords: smallprint printgap noloewdin
keywords: NOSOSCF
formula: C9H20N2O2
InChI: InChI=1/C9H20N2O2/c1-4-8-13-9(12)10-6-5-7-11(2)3/h10H,4-8H2,1-3H3
33 atoms
O  -2.621259 1.000675 -0.639026
O  -1.546282 0.95086 1.346911
N  3.989022 -1.03748 -0.175907
N  -0.424546 1.17515 -0.61948
C  1.694889 -0.069285 -0.322537
C  3.108355 0.042882 0.231081
C  0.915879 1.218459 -0.084494
C  5.342064 -0.777285 0.263813
C  3.545096 -2.326882 0.306993
C  -3.89625 0.875479 -0.00314
C  -4.237735 -0.551723 0.377871
C  -1.527038 1.028607 0.133276
C  -4.209746 -1.521528 -0.793362
H  1.742012 -0.273937 -1.396147
H  1.153529 -0.897239 0.14146
H  3.059557 0.134393 1.330907
H  3.549057 0.976805 -0.131771
H  0.857045 1.434787 0.981682
H  1.441695 2.058621 -0.544146
H  -0.531478 1.195526 -1.621935
H  6.01495 -1.553472 -0.104987
H  5.448376 -0.740577 1.359864
H  5.693235 0.176752 -0.133477
H  2.566286 -2.584347 -0.097046
H  3.480235 -2.383368 1.40583
H  4.239194 -3.102337 -0.021316
H  -4.605704 1.243518 -0.745868
H  -3.956999 1.536597 0.863874
H  -3.575377 -0.899812 1.173063
H  -5.242057 -0.525859 0.809703
H  -3.214051 -1.60725 -1.230104
H  -4.508784 -2.520905 -0.475339
H  -4.89455 -1.210822 -1.584967
elementType: O N C H
totalener: -615.06212504 hartree
nucrepener: 829.36555075 hartree
electener: -1444.42767579 hartree
oneelecener: -2480.49962665 hartree
twoeener: 1036.07195085 hartree
cpcmener: -0.02130564 hartree
kineticenergy: 612.20272787 hartree
xcener: -59.908949482375 hartree
chargesum: -0.0000000
charge: -0.341536 -0.542040 -0.231983 -0.233556 -0.056400 -0.116157 -0.046921 -0.189834 -0.195888 0.020680 -0.109816 0.511978 -0.260504 0.062815 0.069858 0.069935 0.081750 0.089117 0.101256 0.169877 0.098716 0.074645 0.096552 0.100154 0.076945 0.099435 0.107755 0.102573 0.067750 0.073063 0.079665 0.091423 0.078693
qa: -0.3415 -0.5420 -0.2320 -0.2336 -0.0564 -0.1162 -0.0469 -0.1898 -0.1959 0.0207 -0.1098 0.5120 -0.2605 0.0628 0.0699 0.0699 0.0817 0.0891 0.1013 0.1699 0.0987 0.0746 0.0966 0.1002 0.0769 0.0994 0.1078 0.1026 0.0678 0.0731 0.0797 0.0914 0.0787
va: 2.0527 1.9642 2.9080 3.1884 3.8053 3.9523 3.8757 3.9338 3.9301 3.8620 3.8648 4.3091 3.9249 1.0287 1.0187 1.0067 1.0010 1.0264 1.0021 1.0186 0.9949 1.0032 0.9962 0.9940 1.0029 0.9949 0.9969 1.0158 1.0229 1.0132 1.0094 1.0047 1.0014
dispcorr: -0.011159920 hartree
energy: -615.073284962440
dipole: 8.04828 -7.86806 0.18022 -8.77686 8.77561 -0.00125 -0.16105 -0.80315 -0.96419
magnitude: 0.98089 au
magnitude: 2.49322 debye
