program: Orca
programVersion: 5.0.2
elementType: O O N N C C C C C C C C C H H H H H H H H H H H H H H H H H H H H
charge: 0
multiplicity: 1
keywords: wb97x-d3
keywords: def2-TZVPP
keywords: def2/J RIJCOSX
keywords: DEFGRID2
keywords: scfconv7
keywords: smallprint printgap noloewdin
keywords: NOSOSCF
formula: C9H20N2O2
InChI: InChI=1/C9H20N2O2/c1-4-8-13-9(12)10-6-5-7-11(2)3/h10H,4-8H2,1-3H3
33 atoms
O  -2.325718 0.685707 -0.270544
O  -0.827019 -0.99663 -0.181221
N  3.66057 -0.71048 -0.05516
N  -0.208452 1.117048 -0.742596
C  1.902738 0.952586 0.551107
C  3.383147 0.603323 0.497613
C  1.212348 0.851227 -0.803364
C  3.064525 -1.775243 0.722225
C  5.085439 -0.911617 -0.19032
C  -3.378173 -0.213433 0.087962
C  -4.665213 0.579189 0.167595
C  -1.093115 0.1757 -0.375683
C  -5.831046 -0.321024 0.547141
H  1.383066 0.321588 1.276643
H  1.815232 1.975307 0.926164
H  3.805518 0.712645 1.51193
H  3.89714 1.341876 -0.125578
H  1.651512 1.567057 -1.499189
H  1.367493 -0.133866 -1.240091
H  -0.517437 2.075618 -0.782162
H  1.976056 -1.712198 0.712128
H  3.390313 -1.782519 1.774832
H  3.328749 -2.741596 0.289648
H  5.625974 -0.887403 0.769191
H  5.518449 -0.139565 -0.829322
H  5.288912 -1.876229 -0.657695
H  -3.161603 -0.682832 1.051767
H  -3.4649 -1.007505 -0.65896
H  -4.56042 1.379153 0.905232
H  -4.86438 1.05635 -0.795548
H  -6.759084 0.247612 0.611014
H  -5.982574 -1.112775 -0.189007
H  -5.672168 -0.797166 1.51654
elementType: O N C H
totalener: -615.06338963 hartree
nucrepener: 834.83638286 hartree
electener: -1449.89977249 hartree
oneelecener: -2491.75457657 hartree
twoeener: 1041.85480408 hartree
cpcmener: -0.02110815 hartree
kineticenergy: 612.19980372 hartree
xcener: -59.908712733112 hartree
chargesum: 0.0000000
charge: -0.328431 -0.542747 -0.243786 -0.241698 -0.127656 -0.094819 -0.032752 -0.189007 -0.193288 0.036655 -0.085542 0.516583 -0.275581 0.080172 0.084208 0.082191 0.089138 0.103656 0.088005 0.171816 0.089698 0.079462 0.098853 0.071583 0.097442 0.098515 0.091112 0.090836 0.063476 0.063948 0.092835 0.082940 0.082186
qa: -0.3284 -0.5427 -0.2438 -0.2417 -0.1277 -0.0948 -0.0328 -0.1890 -0.1933 0.0367 -0.0855 0.5166 -0.2756 0.0802 0.0842 0.0822 0.0891 0.1037 0.0880 0.1718 0.0897 0.0795 0.0989 0.0716 0.0974 0.0985 0.0911 0.0908 0.0635 0.0639 0.0928 0.0829 0.0822
va: 2.0719 1.9573 2.8630 3.1899 3.8283 3.9098 3.8288 3.9248 3.9357 3.8508 3.9229 4.2905 3.9516 1.0141 1.0190 1.0097 0.9991 1.0055 1.0380 1.0179 1.0068 1.0048 0.9978 1.0012 0.9964 0.9961 0.9997 0.9992 1.0104 1.0101 1.0036 1.0012 1.0016
dispcorr: -0.011473255 hartree
energy: -615.074862889385
dipole: 3.96906 -3.99553 -0.02647 -1.84270 3.27581 1.43311 4.20750 -3.96980 0.23770
magnitude: 1.45293 au
magnitude: 3.69305 debye
