program: Orca
programVersion: 5.0.2
elementType: O O N N C C C C C C C C C H H H H H H H H H H H H H H H H H H H H
charge: 0
multiplicity: 1
keywords: wb97x-d3
keywords: def2-TZVPP
keywords: def2/J RIJCOSX
keywords: DEFGRID2
keywords: scfconv7
keywords: smallprint printgap noloewdin
keywords: NOSOSCF
formula: C9H20N2O2
InChI: InChI=1/C9H20N2O2/c1-4-8-13-9(12)10-6-5-7-11(2)3/h10H,4-8H2,1-3H3
33 atoms
O  -2.319889 0.712366 -0.233833
O  -0.772391 -0.895261 -0.543377
N  3.65692 -0.615389 -0.079328
N  -0.199604 1.302348 -0.462449
C  1.84106 0.814395 0.862446
C  3.327647 0.493531 0.798953
C  1.230738 1.087524 -0.507169
C  5.089627 -0.767159 -0.190494
C  3.042288 -1.856103 0.338478
C  -3.352955 -0.273911 -0.158326
C  -4.647988 0.430337 0.182871
C  -1.068207 0.27913 -0.415365
C  -5.795096 -0.564008 0.278677
H  1.292858 0.007639 1.35547
H  1.715677 1.695582 1.497747
H  3.691852 0.31735 1.826709
H  3.862864 1.375585 0.433638
H  1.683342 1.978853 -0.944671
H  1.443097 0.268191 -1.192309
H  -0.536302 2.226496 -0.241043
H  5.541132 0.155968 -0.558839
H  5.331439 -1.55767 -0.903159
H  5.581257 -1.019005 0.763288
H  3.316624 -2.157571 1.362736
H  3.345058 -2.661425 -0.332579
H  1.954684 -1.796422 0.289385
H  -3.111832 -1.014549 0.608864
H  -3.441447 -0.797822 -1.114412
H  -4.537183 0.95907 1.133148
H  -4.872894 1.182131 -0.57802
H  -5.954896 -1.084484 -0.667272
H  -5.607792 -1.319525 1.043935
H  -6.72707 -0.060963 0.536491
elementType: O N C H
totalener: -615.06333851 hartree
nucrepener: 835.85866047 hartree
electener: -1450.92199898 hartree
oneelecener: -2493.80415356 hartree
twoeener: 1042.88215458 hartree
cpcmener: -0.02107426 hartree
kineticenergy: 612.19946571 hartree
xcener: -59.908707991336 hartree
chargesum: -0.0000000
charge: -0.328278 -0.542906 -0.242503 -0.242171 -0.129696 -0.094733 -0.031473 -0.193341 -0.188889 0.038145 -0.083861 0.517065 -0.275416 0.080152 0.085204 0.082039 0.089276 0.102569 0.087510 0.171537 0.097010 0.098356 0.071847 0.079283 0.098525 0.089621 0.088620 0.092633 0.062454 0.063641 0.082785 0.082038 0.092959
qa: -0.3283 -0.5429 -0.2425 -0.2422 -0.1297 -0.0947 -0.0315 -0.1933 -0.1889 0.0381 -0.0839 0.5171 -0.2754 0.0802 0.0852 0.0820 0.0893 0.1026 0.0875 0.1715 0.0970 0.0984 0.0718 0.0793 0.0985 0.0896 0.0886 0.0926 0.0625 0.0636 0.0828 0.0820 0.0930
va: 2.0728 1.9571 2.8628 3.1894 3.8296 3.9080 3.8286 3.9354 3.9243 3.8491 3.9217 4.2913 3.9516 1.0140 1.0188 1.0097 0.9990 1.0057 1.0396 1.0179 0.9966 0.9960 1.0012 1.0050 0.9976 1.0074 1.0015 0.9982 1.0108 1.0101 1.0014 1.0013 1.0039
dispcorr: -0.011506951 hartree
energy: -615.074845463143
dipole: 3.80246 -3.88814 -0.08569 -3.00623 4.30903 1.30280 4.17501 -3.50461 0.67040
magnitude: 1.46767 au
magnitude: 3.73053 debye
