program: Orca
programVersion: 5.0.2
elementType: O O N N C C C C C C C C C H H H H H H H H H H H H H H H H H H H H
charge: 0
multiplicity: 1
keywords: wb97x-d3
keywords: def2-TZVPP
keywords: def2/J RIJCOSX
keywords: DEFGRID2
keywords: scfconv7
keywords: smallprint printgap noloewdin
keywords: NOSOSCF
formula: C9H20N2O2
InChI: InChI=1/C9H20N2O2/c1-4-8-13-9(12)10-6-5-7-11(2)3/h10H,4-8H2,1-3H3
33 atoms
O  -2.058959 0.464875 0.974531
O  -1.393716 1.48599 -0.926579
N  3.620619 -1.006164 -0.215674
N  -0.021877 1.308415 0.875221
C  2.016132 0.881864 -0.500971
C  2.613073 -0.174019 0.419027
C  1.150431 1.884903 0.25301
C  4.30732 -1.808147 0.772523
C  3.064574 -1.84938 -1.251131
C  -3.36389 0.224103 0.442632
C  -3.42851 -1.019262 -0.422848
C  -1.170555 1.10951 0.208599
C  -4.860481 -1.295843 -0.856714
H  2.827019 1.432907 -0.985383
H  1.421423 0.428663 -1.297846
H  1.806006 -0.790081 0.853886
H  3.093265 0.338358 1.259056
H  1.735424 2.360166 1.042713
H  0.835311 2.681847 -0.420402
H  0.075343 0.898175 1.790208
H  5.100038 -2.39089 0.300152
H  3.64876 -2.514496 1.303621
H  4.774452 -1.166713 1.522014
H  2.276126 -2.527429 -0.885947
H  3.851216 -2.466292 -1.688338
H  2.640344 -1.254365 -2.06009
H  -3.723644 1.099776 -0.102407
H  -3.999541 0.101364 1.320855
H  -2.794238 -0.899768 -1.303688
H  -3.039889 -1.873253 0.138242
H  -5.514188 -1.460397 0.001812
H  -5.272903 -0.46405 -1.430799
H  -4.914728 -2.184717 -1.485065
elementType: O N C H
totalener: -615.06218009 hartree
nucrepener: 842.21701845 hartree
electener: -1457.27919854 hartree
oneelecener: -2506.14709843 hartree
twoeener: 1048.86789988 hartree
cpcmener: -0.02164716 hartree
kineticenergy: 612.20275438 hartree
xcener: -59.908266307177 hartree
chargesum: -0.0000000
charge: -0.337756 -0.543662 -0.232667 -0.237828 -0.072475 -0.105283 -0.074486 -0.189521 -0.195564 0.033016 -0.094020 0.517665 -0.272914 0.068852 0.069923 0.067607 0.086291 0.105887 0.100332 0.176471 0.098347 0.073973 0.096671 0.074917 0.099151 0.101454 0.089444 0.107519 0.067065 0.062600 0.081549 0.084586 0.092856
qa: -0.3378 -0.5437 -0.2327 -0.2378 -0.0725 -0.1053 -0.0745 -0.1895 -0.1956 0.0330 -0.0940 0.5177 -0.2729 0.0689 0.0699 0.0676 0.0863 0.1059 0.1003 0.1765 0.0983 0.0740 0.0967 0.0749 0.0992 0.1015 0.0894 0.1075 0.0671 0.0626 0.0815 0.0846 0.0929
va: 2.0726 1.9581 2.9091 3.1754 3.7583 3.9181 3.9262 3.9321 3.9331 3.8535 3.8612 4.3042 3.9470 1.0305 1.0263 1.0178 0.9999 1.0010 1.0182 1.0143 0.9953 1.0023 0.9964 1.0042 0.9946 0.9928 1.0151 0.9990 1.0238 1.0121 1.0018 1.0010 1.0027
dispcorr: -0.011441978 hartree
energy: -615.073622068952
dipole: 4.09919 -3.90806 0.19112 -9.97530 9.26022 -0.71508 -1.65398 2.97181 1.31783
magnitude: 1.51147 au
magnitude: 3.84186 debye
