program: Orca
programVersion: 5.0.2
elementType: O O N N C C C C C C C C C H H H H H H H H H H H H H H H H H H H H
charge: 0
multiplicity: 1
keywords: wb97x-d3
keywords: def2-TZVPP
keywords: def2/J RIJCOSX
keywords: DEFGRID2
keywords: scfconv7
keywords: smallprint printgap noloewdin
keywords: NOSOSCF
formula: C9H20N2O2
InChI: InChI=1/C9H20N2O2/c1-4-8-13-9(12)10-6-5-7-11(2)3/h10H,4-8H2,1-3H3
33 atoms
O  -2.180857 0.558172 0.163404
O  -0.886823 1.160713 -1.57882
N  3.091524 -1.461546 -0.215545
N  -0.180083 1.39356 0.572288
C  2.234213 0.80645 0.543135
C  2.114794 -0.401059 -0.388312
C  1.160763 1.860321 0.297206
C  2.993475 -2.134699 1.058478
C  4.446633 -1.054444 -0.502814
C  -3.244661 0.198751 -0.722755
C  -4.381754 -0.348576 0.110653
C  -1.060061 1.044405 -0.380008
C  -4.040166 -1.629975 0.856345
H  2.18751 0.489957 1.589822
H  3.205066 1.292821 0.411521
H  2.174037 -0.054463 -1.425286
H  1.124439 -0.851309 -0.272248
H  1.355638 2.729095 0.928769
H  1.199708 2.211793 -0.73358
H  -0.420901 1.207339 1.533897
H  3.610815 -3.035895 1.05182
H  1.963496 -2.447926 1.240419
H  3.314884 -1.532421 1.921422
H  5.098295 -1.930397 -0.53837
H  4.882055 -0.359736 0.231171
H  4.495243 -0.572795 -1.481322
H  -2.901499 -0.552335 -1.439705
H  -3.572983 1.076364 -1.285483
H  -4.728967 0.418529 0.808175
H  -5.212615 -0.533633 -0.574862
H  -3.721434 -2.414792 0.167337
H  -3.241478 -1.48332 1.584177
H  -4.908075 -2.005165 1.39978
elementType: O N C H
totalener: -615.06142875 hartree
nucrepener: 849.65505579 hartree
electener: -1464.71648454 hartree
oneelecener: -2521.11773912 hartree
twoeener: 1056.40125459 hartree
cpcmener: -0.02250517 hartree
kineticenergy: 612.20183668 hartree
xcener: -59.911771163458 hartree
chargesum: -0.0000000
charge: -0.332486 -0.540139 -0.247283 -0.235105 -0.103083 -0.086526 -0.059052 -0.199878 -0.201977 0.019464 -0.100962 0.513595 -0.254263 0.073766 0.073573 0.090466 0.089065 0.104967 0.098031 0.169157 0.100031 0.098299 0.075927 0.100049 0.076532 0.099456 0.095088 0.105921 0.062979 0.065729 0.078140 0.079429 0.091088
qa: -0.3325 -0.5401 -0.2473 -0.2351 -0.1031 -0.0865 -0.0591 -0.1999 -0.2020 0.0195 -0.1010 0.5136 -0.2543 0.0738 0.0736 0.0905 0.0891 0.1050 0.0980 0.1692 0.1000 0.0983 0.0759 0.1000 0.0765 0.0995 0.0951 0.1059 0.0630 0.0657 0.0781 0.0794 0.0911
va: 2.0616 1.9662 2.9130 3.1651 3.7931 3.9267 3.9097 3.9430 3.9451 3.8485 3.9471 4.3087 3.9141 1.0119 1.0156 1.0044 1.0075 0.9993 1.0215 1.0176 0.9942 0.9951 0.9929 0.9940 0.9923 0.9935 1.0006 1.0026 1.0137 1.0114 1.0029 1.0110 1.0044
dispcorr: -0.011987318 hartree
energy: -615.073416068041
dipole: 5.47573 -5.47694 -0.00121 -7.62823 7.76193 0.13370 4.98358 -3.30287 1.68071
magnitude: 1.68602 au
magnitude: 4.28553 debye
